See http://ci.phpmyadmin.net/job/phpMyAdmin-continuous/5615/changes
Changes:
[weblate] Translated using Weblate (Arabic)
[weblate] Translated using Weblate (Armenian)
[weblate] Translated using Weblate (German)
[weblate] Translated using Weblate (Italian)
[weblate] Translated using Weblate (Malay)
[weblate] Translated using Weblate (Polish)
[weblate] Translated using Weblate (Portuguese)
[weblate] Translated using Weblate (Arabic)
[weblate] Translated using Weblate (Bulgarian)
[weblate] Translated using Weblate (Estonian)
[weblate] Translated using Weblate (Lithuanian)
[weblate] Translated using Weblate (Slovak)
[weblate] Translated using Weblate (Slovenian)
[weblate] Translated using Weblate (Spanish)
[weblate] Translated using Weblate (Ukrainian)
------------------------------------------ Started by GitHub push by weblate Started by GitHub push by weblate Started by GitHub push by weblate Started by GitHub push by weblate Started by GitHub push by weblate Started by GitHub push by weblate Started by GitHub push by weblate Started by GitHub push by weblate Started by GitHub push by nijel [EnvInject] - Loading node environment variables. Building in workspace http://ci.phpmyadmin.net/job/phpMyAdmin-continuous/ws/ Fetching changes from the remote Git repository Fetching upstream changes from git://github.com/phpmyadmin/phpmyadmin.git Checking out Revision 16d4b0502a6372bf876e3a5fc07f45d4de3041b1 (origin/master) [EnvInject] - Executing scripts and injecting environment variables after the SCM step. [EnvInject] - Injecting as environment variables the properties content TESTSUITE_SERVER=localhost TESTSUITE_USER=pmatest TESTSUITE_DATABASE=pmatest TESTSUITE_URL=http://ci-live.phpmyadmin.net/phpMyAdmin-continuous/workspace/ TESTSUITE_BROWSERSTACK_USER=michaliha
[EnvInject] - Variables injected successfully. [workspace] $ /bin/sh -xe /tmp/hudson7916628286174261359.sh + ./scripts/generate-mo --quiet [workspace] $ ant -DTESTSUITE_BROWSERSTACK_KEY=**** -DTESTSUITE_PASSWORD=**** clean phpunit-nocoverage phpcpd phpcs phploc jshint Unable to locate tools.jar. Expected to find it in /usr/lib/jvm/java-6-openjdk-amd64/lib/tools.jar Buildfile: http://ci.phpmyadmin.net/job/phpMyAdmin-continuous/ws/build.xml
clean: [delete] Deleting directory http://ci.phpmyadmin.net/job/phpMyAdmin-continuous/ws/build/api [delete] Deleting directory http://ci.phpmyadmin.net/job/phpMyAdmin-continuous/ws/build/code-browser [delete] Deleting directory http://ci.phpmyadmin.net/job/phpMyAdmin-continuous/ws/build/coverage [delete] Deleting directory http://ci.phpmyadmin.net/job/phpMyAdmin-continuous/ws/build/logs [delete] Deleting directory http://ci.phpmyadmin.net/job/phpMyAdmin-continuous/ws/build/pdepend [mkdir] Created dir: http://ci.phpmyadmin.net/job/phpMyAdmin-continuous/ws/build/api [mkdir] Created dir: http://ci.phpmyadmin.net/job/phpMyAdmin-continuous/ws/build/code-browser [mkdir] Created dir: http://ci.phpmyadmin.net/job/phpMyAdmin-continuous/ws/build/coverage [mkdir] Created dir: http://ci.phpmyadmin.net/job/phpMyAdmin-continuous/ws/build/logs [mkdir] Created dir: http://ci.phpmyadmin.net/job/phpMyAdmin-continuous/ws/build/pdepend
phpunit-nocoverage: [exec] Enabling headers testing using runkit... [exec] PHPUnit 3.7.31 by Sebastian Bergmann. [exec] [exec] Configuration read from http://ci.phpmyadmin.net/job/phpMyAdmin-continuous/ws/phpunit.xml.nocoverage [exec] [exec] ............................................................. 61 / 2258 ( 2%) [exec] [33;1mI[0m........................................[33;1mI[0m................... 122 / 2258 ( 5%) [exec] ............................................................. 183 / 2258 ( 8%) [exec] ............................................................. 244 / 2258 ( 10%) [exec] ............................................................. 305 / 2258 ( 13%) [exec] ............................................................. 366 / 2258 ( 16%) [exec] ............................................................. 427 / 2258 ( 18%) [exec] ............................................................. 488 / 2258 ( 21%) [exec] ............................................................. 549 / 2258 ( 24%) [exec] ............................................................. 610 / 2258 ( 27%) [exec] ............................................................. 671 / 2258 ( 29%) [exec] ............................................................. 732 / 2258 ( 32%) [exec] ............................................................. 793 / 2258 ( 35%) [exec] ............................................................. 854 / 2258 ( 37%) [exec] ............................................................. 915 / 2258 ( 40%) [exec] ............................................................. 976 / 2258 ( 43%) [exec] ............................................................. 1037 / 2258 ( 45%) [exec] ............................................................. 1098 / 2258 ( 48%) [exec] ............................................................. 1159 / 2258 ( 51%) [exec] ............................................................. 1220 / 2258 ( 54%) [exec] ............................................................. 1281 / 2258 ( 56%) [exec] ............................................................. 1342 / 2258 ( 59%) [exec] ............................................................. 1403 / 2258 ( 62%) [exec] ............................................................. 1464 / 2258 ( 64%) [exec] ............................................................. 1525 / 2258 ( 67%) [exec] ............................................................. 1586 / 2258 ( 70%) [exec] ............................................................. 1647 / 2258 ( 72%) [exec] ............................................................. 1708 / 2258 ( 75%) [exec] ............................................................. 1769 / 2258 ( 78%) [exec] ............................................................. 1830 / 2258 ( 81%) [exec] ............................................................. 1891 / 2258 ( 83%) [exec] ............................................................. 1952 / 2258 ( 86%) [exec] ......................................................[33;1mI[0m...... 2013 / 2258 ( 89%) [exec] ............................................................. 2074 / 2258 ( 91%) [exec] ............................................................. 2135 / 2258 ( 94%) [exec] ............................................................. 2196 / 2258 ( 97%) [exec] .....[33;1mI[0m[36;1mS[0m[36;1mS[0m...[36;1mS[0m......[31;1mE[0m............[33;1mI[0m[33;1mI[0m[33;1mI[0m...[33;1mI[0m..........[33;1mI[0m........[36;1mS[0m[36;1mS[0m[36;1mS[0m[36;1mS[0m 2257 / 2258 ( 99%) [exec] . [exec] [exec] Time: 16 minutes, Memory: 111.50Mb [exec] [exec] There was 1 error: [exec] [exec] 1) PMA_SeleniumDbStructureTest::testDropMultipleTables [exec] PHPUnit_Extensions_Selenium2TestCase_WebDriverException: Unable to communicate to node [exec] [exec] http://ci.phpmyadmin.net/job/phpMyAdmin-continuous/ws/test/selenium/TestBase.php:242 [exec] http://ci.phpmyadmin.net/job/phpMyAdmin-continuous/ws/test/selenium/TestBase.php:242 [exec] http://ci.phpmyadmin.net/job/phpMyAdmin-continuous/ws/test/selenium/PmaSeleniumDbStructureTest.php:54 [exec] [exec] There were 9 incomplete tests: [exec] [exec] 1) PMA_ConfigTest::testCheckPermissions [exec] This test has not been implemented yet. [exec] [exec] http://ci.phpmyadmin.net/job/phpMyAdmin-continuous/ws/test/classes/PMA_Config_test.php:956 [exec] [exec] 2) PMA_DisplayResults_Test::testGetTableNavigation with data set #0 (21, 41, '123', false, '310') [exec] Not yet implemented! [exec] [exec] http://ci.phpmyadmin.net/job/phpMyAdmin-continuous/ws/test/classes/PMA_DisplayResults_test.php:438 [exec] [exec] 3) PMA_TblColumnsDefinitionFormTest::testGetFormParamsForOldColumn [exec] Not yet implemented! [exec] [exec] http://ci.phpmyadmin.net/job/phpMyAdmin-continuous/ws/test/libraries/PMA_tbl_columns_definition_form_test.php:1101 [exec] [exec] 4) Environment_Test::testSession [exec] No session testing [exec] [exec] http://ci.phpmyadmin.net/job/phpMyAdmin-continuous/ws/test/Environment_test.php:81 [exec] [exec] 5) PMA_SeleniumImportTest::testServerImport [exec] File uploading not yet implemented in Selenium test [exec] [exec] http://ci.phpmyadmin.net/job/phpMyAdmin-continuous/ws/test/selenium/PmaSeleniumImportTest.php:121 [exec] http://ci.phpmyadmin.net/job/phpMyAdmin-continuous/ws/test/selenium/PmaSeleniumImportTest.php:39 [exec] [exec] 6) PMA_SeleniumImportTest::testDbImport [exec] File uploading not yet implemented in Selenium test [exec] [exec] http://ci.phpmyadmin.net/job/phpMyAdmin-continuous/ws/test/selenium/PmaSeleniumImportTest.php:121 [exec] http://ci.phpmyadmin.net/job/phpMyAdmin-continuous/ws/test/selenium/PmaSeleniumImportTest.php:65 [exec] [exec] 7) PMA_SeleniumImportTest::testTableImport [exec] File uploading not yet implemented in Selenium test [exec] [exec] http://ci.phpmyadmin.net/job/phpMyAdmin-continuous/ws/test/selenium/PmaSeleniumImportTest.php:121 [exec] http://ci.phpmyadmin.net/job/phpMyAdmin-continuous/ws/test/selenium/PmaSeleniumImportTest.php:103 [exec] [exec] 8) PMA_SeleniumSettingsTest::testHideDatabase [exec] Currently broken [exec] [exec] http://ci.phpmyadmin.net/job/phpMyAdmin-continuous/ws/test/selenium/PmaSeleniumServerSettingsTest.php:60 [exec] [exec] 9) PMA_SeleniumTableOperationsTest::testChangeTableOrder [exec] Changing order is not supported for some tables. [exec] [exec] http://ci.phpmyadmin.net/job/phpMyAdmin-continuous/ws/test/selenium/PmaSeleniumTableOperationsTest.php:70 [exec] [exec] -- [exec] [exec] [exec] There were 7 skipped tests: [exec] [exec] 1) PMA_SeleniumCreateDropDatabaseTest::testCreateDropDatabase [exec] Test user is not a superuser. [exec] [exec] http://ci.phpmyadmin.net/job/phpMyAdmin-continuous/ws/test/selenium/TestBase.php:192 [exec] http://ci.phpmyadmin.net/job/phpMyAdmin-continuous/ws/test/selenium/PmaSeleniumCreateDropDatabaseTest.php:29 [exec] [exec] 2) PMA_SeleniumCreateRemoveUserTest::testCreateRemoveUser [exec] Test user is not a superuser. [exec] [exec] http://ci.phpmyadmin.net/job/phpMyAdmin-continuous/ws/test/selenium/TestBase.php:192 [exec] http://ci.phpmyadmin.net/job/phpMyAdmin-continuous/ws/test/selenium/PmaSeleniumCreateRemoveUserTest.php:44 [exec] [exec] 3) PMA_SeleniumDbOperationsTest::testDbComment [exec] The phpMyAdmin configuration storage is not working. [exec] [exec] http://ci.phpmyadmin.net/job/phpMyAdmin-continuous/ws/test/selenium/TestBase.php:207 [exec] http://ci.phpmyadmin.net/job/phpMyAdmin-continuous/ws/test/selenium/PmaSeleniumDbOperationsTest.php:45 [exec] [exec] 4) PMA_SeleniumTrackingTest::testTrackingData [exec] The phpMyAdmin configuration storage is not working. [exec] [exec] http://ci.phpmyadmin.net/job/phpMyAdmin-continuous/ws/test/selenium/TestBase.php:207 [exec] http://ci.phpmyadmin.net/job/phpMyAdmin-continuous/ws/test/selenium/PmaSeleniumTrackingTest.php:56 [exec] [exec] 5) PMA_SeleniumTrackingTest::testDeactivateTracking [exec] The phpMyAdmin configuration storage is not working. [exec] [exec] http://ci.phpmyadmin.net/job/phpMyAdmin-continuous/ws/test/selenium/TestBase.php:207 [exec] http://ci.phpmyadmin.net/job/phpMyAdmin-continuous/ws/test/selenium/PmaSeleniumTrackingTest.php:56 [exec] [exec] 6) PMA_SeleniumTrackingTest::testDropTracking [exec] The phpMyAdmin configuration storage is not working. [exec] [exec] http://ci.phpmyadmin.net/job/phpMyAdmin-continuous/ws/test/selenium/TestBase.php:207 [exec] http://ci.phpmyadmin.net/job/phpMyAdmin-continuous/ws/test/selenium/PmaSeleniumTrackingTest.php:56 [exec] [exec] 7) PMA_SeleniumTrackingTest::testStructureSnapshot [exec] The phpMyAdmin configuration storage is not working. [exec] [exec] http://ci.phpmyadmin.net/job/phpMyAdmin-continuous/ws/test/selenium/TestBase.php:207 [exec] http://ci.phpmyadmin.net/job/phpMyAdmin-continuous/ws/test/selenium/PmaSeleniumTrackingTest.php:56 [exec] [exec] [37;41m[2KFAILURES! [exec] [0m[37;41m[2KTests: 2258, Assertions: 5481, Errors: 1, Incomplete: 9, Skipped: 7. [exec] [0m[2K
BUILD FAILED http://ci.phpmyadmin.net/job/phpMyAdmin-continuous/ws/build.xml:31: exec returned: 2
Total time: 16 minutes 1 second Build step 'Invoke Ant' marked build as failure [CHECKSTYLE] Skipping publisher since build result is FAILURE [JSLINT] Skipping publisher since build result is FAILURE [PMD] Skipping publisher since build result is FAILURE [DRY] Collecting duplicate code analysis files... [DRY] Finding all files that match the pattern build/logs/pmd-cpd.xml [DRY] Computing warning deltas based on reference build #5603 [TASKS] Skipping publisher since build result is FAILURE [ANALYSIS-COLLECTOR] Computing warning deltas based on reference build #5603 Recording plot data [xUnit] [INFO] - Starting to record. [xUnit] [INFO] - Processing PHPUnit-3.x (default) [xUnit] [INFO] - [PHPUnit-3.x (default)] - 1 test report file(s) were found with the pattern 'build/logs/junit.xml' relative to 'http://ci.phpmyadmin.net/job/phpMyAdmin-continuous/ws/' for the testing framework 'PHPUnit-3.x (default)'. [xUnit] [INFO] - Check 'Failed Tests' threshold. [xUnit] [INFO] - Check 'Skipped Tests' threshold. [xUnit] [INFO] - Setting the build status to FAILURE [xUnit] [INFO] - Stopping recording.