See http://ci.phpmyadmin.net/job/phpMyAdmin-continuous/4165/changes
Changes:
[marc] bug #4056 Language: Vague error message when adding a varchar field
------------------------------------------ Started by GitHub push by lem9 Building in workspace http://ci.phpmyadmin.net/job/phpMyAdmin-continuous/ws/ Checkout:workspace / http://ci.phpmyadmin.net/job/phpMyAdmin-continuous/ws/ - hudson.remoting.LocalChannel@435d8888 Using strategy: Default Last Built Revision: Revision 15de2de0fce1b7951101f35fbacaf3a3426c8d72 (origin/master) Fetching changes from 1 remote Git repository Fetching upstream changes from origin Commencing build of Revision 3df8d3db6ba10c3ad7675727a750f2ba74a41d51 (origin/master) Checking out Revision 3df8d3db6ba10c3ad7675727a750f2ba74a41d51 (origin/master) [workspace] $ /bin/sh -xe /tmp/hudson5168332103744869866.sh + ./scripts/generate-mo --quiet [workspace] $ ant clean phpunit-nocoverage phpcpd phpcs phploc jshint Unable to locate tools.jar. Expected to find it in /usr/lib/jvm/java-7-openjdk-amd64/lib/tools.jar Buildfile: http://ci.phpmyadmin.net/job/phpMyAdmin-continuous/ws/build.xml
clean: [delete] Deleting directory http://ci.phpmyadmin.net/job/phpMyAdmin-continuous/ws/build/api [delete] Deleting directory http://ci.phpmyadmin.net/job/phpMyAdmin-continuous/ws/build/code-browser [delete] Deleting directory http://ci.phpmyadmin.net/job/phpMyAdmin-continuous/ws/build/coverage [delete] Deleting directory http://ci.phpmyadmin.net/job/phpMyAdmin-continuous/ws/build/logs [delete] Deleting directory http://ci.phpmyadmin.net/job/phpMyAdmin-continuous/ws/build/pdepend [mkdir] Created dir: http://ci.phpmyadmin.net/job/phpMyAdmin-continuous/ws/build/api [mkdir] Created dir: http://ci.phpmyadmin.net/job/phpMyAdmin-continuous/ws/build/code-browser [mkdir] Created dir: http://ci.phpmyadmin.net/job/phpMyAdmin-continuous/ws/build/coverage [mkdir] Created dir: http://ci.phpmyadmin.net/job/phpMyAdmin-continuous/ws/build/logs [mkdir] Created dir: http://ci.phpmyadmin.net/job/phpMyAdmin-continuous/ws/build/pdepend
phpunit-nocoverage: [exec] Enabling headers testing... [exec] [exec] [exec] [exec] [exec] [exec] [exec] [exec] [exec] PHPUnit 3.7.22 by Sebastian Bergmann. [exec] [exec] Configuration read from http://ci.phpmyadmin.net/job/phpMyAdmin-continuous/ws/phpunit.xml.nocoverage [exec] [exec] ............................................................[33;1mI[0m 61 / 1948 ( 3%) [exec] ............................................................. 122 / 1948 ( 6%) [exec] .............[31;1mE[0m............................................... 183 / 1948 ( 9%) [exec] ............................................................. 244 / 1948 ( 12%) [exec] ............................................................. 305 / 1948 ( 15%) [exec] ............................................................. 366 / 1948 ( 18%) [exec] ............................................................. 427 / 1948 ( 21%) [exec] ............................................................. 488 / 1948 ( 25%) [exec] ............................................................. 549 / 1948 ( 28%) [exec] ..........................................[31;1mE[0m.................. 610 / 1948 ( 31%) [exec] ...................................[33;1mI[0m......................... 671 / 1948 ( 34%) [exec] ............................................................. 732 / 1948 ( 37%) [exec] ............................................................. 793 / 1948 ( 40%) [exec] ............................................................. 854 / 1948 ( 43%) [exec] ............................................................. 915 / 1948 ( 46%) [exec] ............................................................. 976 / 1948 ( 50%) [exec] ............................................................. 1037 / 1948 ( 53%) [exec] ............................................................. 1098 / 1948 ( 56%) [exec] ............................................................. 1159 / 1948 ( 59%) [exec] ............................................................. 1220 / 1948 ( 62%) [exec] ............................................................. 1281 / 1948 ( 65%) [exec] ............................................................. 1342 / 1948 ( 68%) [exec] ............................................................. 1403 / 1948 ( 72%) [exec] ............................................................. 1464 / 1948 ( 75%) [exec] ............................................................. 1525 / 1948 ( 78%) [exec] ............................................................. 1586 / 1948 ( 81%) [exec] ............................................................. 1647 / 1948 ( 84%) [exec] ............................................................. 1708 / 1948 ( 87%) [exec] ............................................................. 1769 / 1948 ( 90%) [exec] ............................................................. 1830 / 1948 ( 93%) [exec] ............................................................. 1891 / 1948 ( 97%) [exec] .......................................................[36;1mS[0m[33;1mI[0m [exec] [exec] Time: 34 seconds, Memory: 102.00Mb [exec] [exec] There were 2 errors: [exec] [exec] 1) PMA_Error_Handler_Test::testGetDispErrorsForDisplayFalse with data set #1 (1024, 'User notice', 'error.txt', 12, 'User notice', 'User notice') [exec] PHP_Invoker_TimeoutException: Execution aborted after 1 second [exec] [exec] http://ci.phpmyadmin.net/job/phpMyAdmin-continuous/ws/themes/pmahomme/sprites.lib.php:739 [exec] http://ci.phpmyadmin.net/job/phpMyAdmin-continuous/ws/libraries/Util.class.php:185 [exec] http://ci.phpmyadmin.net/job/phpMyAdmin-continuous/ws/libraries/Message.class.php:744 [exec] http://ci.phpmyadmin.net/job/phpMyAdmin-continuous/ws/libraries/Message.class.php:643 [exec] http://ci.phpmyadmin.net/job/phpMyAdmin-continuous/ws/libraries/Error.class.php:346 [exec] http://ci.phpmyadmin.net/job/phpMyAdmin-continuous/ws/libraries/Error_Handler.class.php:270 [exec] http://ci.phpmyadmin.net/job/phpMyAdmin-continuous/ws/libraries/Error_Handler.class.php:339 [exec] http://ci.phpmyadmin.net/job/phpMyAdmin-continuous/ws/test/classes/PMA_Error_Handler_test.php:119 [exec] [exec] 2) Node_Column_Test::testConstructor [exec] PHP_Invoker_TimeoutException: Execution aborted after 1 second [exec] [exec] http://ci.phpmyadmin.net/job/phpMyAdmin-continuous/ws/libraries/navigation/Nodes/Node_Column.class.php:17 [exec] http://ci.phpmyadmin.net/job/phpMyAdmin-continuous/ws/libraries/navigation/NodeFactory.class.php:92 [exec] http://ci.phpmyadmin.net/job/phpMyAdmin-continuous/ws/test/classes/navigation/PMA_Node_Column_test.php:39 [exec] [exec] There were 3 incomplete tests: [exec] [exec] 1) PMA_ConfigTest::testCheckPermissions [exec] This test has not been implemented yet. [exec] [exec] http://ci.phpmyadmin.net/job/phpMyAdmin-continuous/ws/test/classes/PMA_Config_test.php:943 [exec] [exec] 2) PMA_AuthenticationCookie_Test::testBlowfishDecrypt [exec] This test did not perform any assertions [exec] [exec] [exec] 3) Environment_Test::testSession [exec] [exec] http://ci.phpmyadmin.net/job/phpMyAdmin-continuous/ws/test/Environment_test.php:83 [exec] [exec] -- [exec] [exec] [exec] There was 1 skipped test: [exec] [exec] 1) Environment_Test::testMySQL [exec] Error: Execution aborted after 1 second [exec] [exec] http://ci.phpmyadmin.net/job/phpMyAdmin-continuous/ws/test/Environment_test.php:62 [exec] [exec] [37;41m[2KFAILURES! [exec] [0m[37;41m[2KTests: 1948, Assertions: 4313, Errors: 2, Incomplete: 3, Skipped: 1. [exec] [0m[2K
BUILD FAILED http://ci.phpmyadmin.net/job/phpMyAdmin-continuous/ws/build.xml:28: exec returned: 2
Total time: 37 seconds Build step 'Invoke Ant' marked build as failure [CHECKSTYLE] Skipping publisher since build result is FAILURE [DRY] Collecting duplicate code analysis files... [DRY] Finding all files that match the pattern build/logs/pmd-cpd.xml [DRY] Computing warning deltas based on reference build #4164 [TASKS] Skipping publisher since build result is FAILURE [ANALYSIS-COLLECTOR] Computing warning deltas based on reference build #4164 Recording plot data [xUnit] [INFO] - Starting to record. [xUnit] [INFO] - Processing PHPUnit-3.x (default) [xUnit] [INFO] - [PHPUnit-3.x (default)] - 1 test report file(s) were found with the pattern 'build/logs/junit.xml' relative to 'http://ci.phpmyadmin.net/job/phpMyAdmin-continuous/ws/' for the testing framework 'PHPUnit-3.x (default)'. [xUnit] [INFO] - Check 'Failed Tests' threshold. [xUnit] [INFO] - Check 'Skipped Tests' threshold. [xUnit] [INFO] - Setting the build status to FAILURE [xUnit] [INFO] - Stopping recording.