[Phpmyadmin-devel] Build failed in Jenkins: phpMyAdmin-continuous #2538

michal at cihar.com michal at cihar.com
Mon Dec 17 07:57:36 CET 2012

See <http://ci.phpmyadmin.net/job/phpMyAdmin-continuous/2538/changes>


[weblate] Translated using Weblate (Chinese (Taiwan))

[weblate] Translated using Weblate (Greek)

Started by GitHub push by 
Building in workspace <http://ci.phpmyadmin.net/job/phpMyAdmin-continuous/ws/>
Checkout:workspace / <http://ci.phpmyadmin.net/job/phpMyAdmin-continuous/ws/> - hudson.remoting.LocalChannel at 1fb2979e
Using strategy: Default
Last Built Revision: Revision 59889a676994e6b7c3854e1ea5edb70854eda654 (origin/master)
Fetching changes from 1 remote Git repository
Fetching upstream changes from git://github.com/phpmyadmin/phpmyadmin.git
Commencing build of Revision 4850c8bdb7f4bc6c855d6c06ad4598433366dd6e (origin/master)
Checking out Revision 4850c8bdb7f4bc6c855d6c06ad4598433366dd6e (origin/master)
[workspace] $ /bin/sh -xe /tmp/hudson7007881680431598106.sh
+ ./scripts/generate-mo --quiet
po/zh_TW.po:1187: format specifications in 'msgid' and 'msgstr' for argument 1 are not the same
msgfmt: found 1 fatal error
Build step 'Execute shell' marked build as failure
[CHECKSTYLE] Skipping publisher since build result is FAILURE
[DRY] Collecting duplicate code analysis files...
[DRY] Finding all files that match the pattern build/logs/pmd-cpd.xml
[DRY] Parsing 1 files in <http://ci.phpmyadmin.net/job/phpMyAdmin-continuous/ws/>
[DRY] Successfully parsed file <http://ci.phpmyadmin.net/job/phpMyAdmin-continuous/ws/build/logs/pmd-cpd.xml> of module  with 20 warnings.
[DRY] Computing warning deltas based on reference build #2534
[TASKS] Skipping publisher since build result is FAILURE
[ANALYSIS-COLLECTOR] Computing warning deltas based on reference build #2534
Recording plot data
[xUnit] [INFO] - Starting to record.
[xUnit] [INFO] - Processing PHPUnit-3.4 (default)
[xUnit] [INFO] - [PHPUnit-3.4 (default)] - 1 test report file(s) were found with the pattern 'build/logs/junit.xml' relative to '<http://ci.phpmyadmin.net/job/phpMyAdmin-continuous/ws/'> for the testing framework 'PHPUnit-3.4 (default)'.
[xUnit] [ERROR] - Test reports were found but not all of them are new. Did all the tests run?
  * <http://ci.phpmyadmin.net/job/phpMyAdmin-continuous/ws/build/logs/junit.xml> is 1 day 12 hr old

[xUnit] [INFO] - Setting the build status to FAILURE
[xUnit] [INFO] - Stopping recording.

More information about the Developers mailing list