[Phpmyadmin-devel] Build failed in Jenkins: phpMyAdmin-continuous #5483

michal at cihar.com michal at cihar.com
Mon Feb 17 19:37:50 CET 2014


See <http://ci.phpmyadmin.net/job/phpMyAdmin-continuous/5483/changes>

Changes:

[Michal Čihař] No need to logout, we have asserted we are not logged in

[Michal Čihař] Convert database operations test to new model

[weblate] Translated using Weblate (Portuguese (Brazil))

------------------------------------------
Started by GitHub push by nijel
[EnvInject] - Loading node environment variables.
Building in workspace <http://ci.phpmyadmin.net/job/phpMyAdmin-continuous/ws/>
Fetching changes from the remote Git repository
Fetching upstream changes from git://github.com/phpmyadmin/phpmyadmin.git
Checking out Revision 319306cdada7cd67dc590b357c2738640621928b (origin/master)
[EnvInject] - Executing scripts and injecting environment variables after the SCM step.
[EnvInject] - Injecting as environment variables the properties content 
TESTSUITE_SERVER=localhost
TESTSUITE_USER=pmatest
TESTSUITE_DATABASE=pmatest
TESTSUITE_PHPMYADMIN_HOST=http://ci-live.phpmyadmin.net
TESTSUITE_PHPMYADMIN_URL=/phpMyAdmin/workspace
BS_UNAME=michaliha

[EnvInject] - Variables injected successfully.
[workspace] $ /bin/sh -xe /tmp/hudson6544424125446330665.sh
+ ./scripts/generate-mo --quiet
[workspace] $ ant -DBS_KEY=**** -DTESTSUITE_PASSWORD=**** clean phpunit-nocoverage phpcpd phpcs phploc jshint
Unable to locate tools.jar. Expected to find it in /usr/lib/jvm/java-6-openjdk-amd64/lib/tools.jar
Buildfile: <http://ci.phpmyadmin.net/job/phpMyAdmin-continuous/ws/build.xml>

clean:
   [delete] Deleting directory <http://ci.phpmyadmin.net/job/phpMyAdmin-continuous/ws/build/api>
   [delete] Deleting directory <http://ci.phpmyadmin.net/job/phpMyAdmin-continuous/ws/build/code-browser>
   [delete] Deleting directory <http://ci.phpmyadmin.net/job/phpMyAdmin-continuous/ws/build/coverage>
   [delete] Deleting directory <http://ci.phpmyadmin.net/job/phpMyAdmin-continuous/ws/build/logs>
   [delete] Deleting directory <http://ci.phpmyadmin.net/job/phpMyAdmin-continuous/ws/build/pdepend>
    [mkdir] Created dir: <http://ci.phpmyadmin.net/job/phpMyAdmin-continuous/ws/build/api>
    [mkdir] Created dir: <http://ci.phpmyadmin.net/job/phpMyAdmin-continuous/ws/build/code-browser>
    [mkdir] Created dir: <http://ci.phpmyadmin.net/job/phpMyAdmin-continuous/ws/build/coverage>
    [mkdir] Created dir: <http://ci.phpmyadmin.net/job/phpMyAdmin-continuous/ws/build/logs>
    [mkdir] Created dir: <http://ci.phpmyadmin.net/job/phpMyAdmin-continuous/ws/build/pdepend>

phpunit-nocoverage:
     [exec] Enabling headers testing...
     [exec] 
     [exec] 
     [exec] 
     [exec] 
     [exec] 
     [exec] 
     [exec] 
     [exec] 
     [exec] 
     [exec] 
     [exec] 
     [exec] 
     [exec] PHPUnit 3.7.31 by Sebastian Bergmann.
     [exec] 
     [exec] Configuration read from <http://ci.phpmyadmin.net/job/phpMyAdmin-continuous/ws/phpunit.xml.nocoverage>
     [exec] 
     [exec] .............................................................   61 / 2226 (  2%)
     [exec] I........................................I...................  122 / 2226 (  5%)
     [exec] .............................................................  183 / 2226 (  8%)
     [exec] .............................................................  244 / 2226 ( 10%)
     [exec] .............................................................  305 / 2226 ( 13%)
     [exec] .............................................................  366 / 2226 ( 16%)
     [exec] .............................................................  427 / 2226 ( 19%)
     [exec] .............................................................  488 / 2226 ( 21%)
     [exec] .............................................................  549 / 2226 ( 24%)
     [exec] .............................................................  610 / 2226 ( 27%)
     [exec] .........................................I...................  671 / 2226 ( 30%)
     [exec] .............................................................  732 / 2226 ( 32%)
     [exec] .............................................................  793 / 2226 ( 35%)
     [exec] .............................................................  854 / 2226 ( 38%)
     [exec] .............................................................  915 / 2226 ( 41%)
     [exec] .............................................................  976 / 2226 ( 43%)
     [exec] ............................................................. 1037 / 2226 ( 46%)
     [exec] ............................................................. 1098 / 2226 ( 49%)
     [exec] ............................................................. 1159 / 2226 ( 52%)
     [exec] ............................................................. 1220 / 2226 ( 54%)
     [exec] ............................................................. 1281 / 2226 ( 57%)
     [exec] ............................................................. 1342 / 2226 ( 60%)
     [exec] ............................................................. 1403 / 2226 ( 63%)
     [exec] ............................................................. 1464 / 2226 ( 65%)
     [exec] ............................................................. 1525 / 2226 ( 68%)
     [exec] ............................................................. 1586 / 2226 ( 71%)
     [exec] ............................................................. 1647 / 2226 ( 73%)
     [exec] ............................................................. 1708 / 2226 ( 76%)
     [exec] ............................................................. 1769 / 2226 ( 79%)
     [exec] ............................................................. 1830 / 2226 ( 82%)
     [exec] ............................................................. 1891 / 2226 ( 84%)
     [exec] ............................................................. 1952 / 2226 ( 87%)
     [exec] ......................................................I...... 2013 / 2226 ( 90%)
     [exec] ............................................................. 2074 / 2226 ( 93%)
     [exec] ............................................................. 2135 / 2226 ( 95%)
     [exec] ............................................................. 2196 / 2226 ( 98%)
     [exec] ....SI........E......EEEEEEEEE
     [exec] 
     [exec] Time: 7.08 minutes, Memory: 108.25Mb
     [exec] 
     [exec] There were 10 errors:
     [exec] 
     [exec] 1) PMA_SeleniumXSSTest::testQueryTabWithNullValue
     [exec] PHPUnit_Extensions_Selenium2TestCase_WebDriverException: No alert is active (WARNING: The server did not provide any stacktrace information)
     [exec] Command duration or timeout: 104 milliseconds
     [exec] Build info: version: '2.39.0', revision: 'ff23eac', time: '2013-12-16 16:11:15'
     [exec] System info: host: 'AMAZONA-TO69SD6', ip: '185.44.128.92', os.name: 'windows', os.arch: 'x86', os.version: '6.2', java.version: '1.7.0_45'
     [exec] Session ID: e29d6877-5521-46e4-8f11-81569fdff800
     [exec] Driver info: org.openqa.selenium.ie.InternetExplorerDriver
     [exec] Capabilities [{platform=WINDOWS, javascriptEnabled=true, elementScrollBehavior=0, ignoreZoomSetting=false, enablePersistentHover=true, ie.ensureCleanSession=false, browserName=internet explorer, enableElementCacheCleanup=true, unexpectedAlertBehaviour=dismiss, version=11, ie.usePerProcessProxy=false, cssSelectorsEnabled=true, ignoreProtectedModeSettings=false, requireWindowFocus=false, handlesAlerts=true, initialBrowserUrl=http://localhost:39196/, ie.forceCreateProcessApi=false, nativeEvents=true, browserAttachTimeout=0, ie.browserCommandLineSwitches=, takesScreenshot=true}]
     [exec] 
     [exec] <http://ci.phpmyadmin.net/job/phpMyAdmin-continuous/ws/test/selenium/PmaSeleniumXssTest.php>:33
     [exec] <http://ci.phpmyadmin.net/job/phpMyAdmin-continuous/ws/test/selenium/PmaSeleniumXssTest.php>:33
     [exec] 
     [exec] 2) PmaSeleniumDbOperationsTest::testDbComment
     [exec] PHP_Invoker_TimeoutException: Execution aborted after 3 seconds
     [exec] 
     [exec] 
     [exec] 3) PmaSeleniumDbOperationsTest::testRenameDB
     [exec] PHP_Invoker_TimeoutException: Execution aborted after 3 seconds
     [exec] 
     [exec] 
     [exec] 4) PmaSeleniumDbOperationsTest::testCopyDb
     [exec] PHP_Invoker_TimeoutException: Execution aborted after 3 seconds
     [exec] 
     [exec] 
     [exec] 5) PmaSeleniumDbOperationsTest::testDbComment
     [exec] PHP_Invoker_TimeoutException: Execution aborted after 3 seconds
     [exec] 
     [exec] <http://ci.phpmyadmin.net/job/phpMyAdmin-continuous/ws/test/selenium/TestBase.php>:101
     [exec] <http://ci.phpmyadmin.net/job/phpMyAdmin-continuous/ws/test/selenium/TestBase.php>:101
     [exec] <http://ci.phpmyadmin.net/job/phpMyAdmin-continuous/ws/test/selenium/PmaSeleniumDbOperationsTest.php>:49
     [exec] 
     [exec] 6) PmaSeleniumDbOperationsTest::testRenameDB
     [exec] PHP_Invoker_TimeoutException: Execution aborted after 3 seconds
     [exec] 
     [exec] <http://ci.phpmyadmin.net/job/phpMyAdmin-continuous/ws/test/selenium/TestBase.php>:101
     [exec] <http://ci.phpmyadmin.net/job/phpMyAdmin-continuous/ws/test/selenium/TestBase.php>:101
     [exec] <http://ci.phpmyadmin.net/job/phpMyAdmin-continuous/ws/test/selenium/PmaSeleniumDbOperationsTest.php>:49
     [exec] 
     [exec] 7) PmaSeleniumDbOperationsTest::testCopyDb
     [exec] PHP_Invoker_TimeoutException: Execution aborted after 3 seconds
     [exec] 
     [exec] <http://ci.phpmyadmin.net/job/phpMyAdmin-continuous/ws/test/selenium/TestBase.php>:226
     [exec] <http://ci.phpmyadmin.net/job/phpMyAdmin-continuous/ws/test/selenium/PmaSeleniumDbOperationsTest.php>:54
     [exec] 
     [exec] 8) PmaSeleniumDbOperationsTest::testDbComment
     [exec] PHP_Invoker_TimeoutException: Execution aborted after 3 seconds
     [exec] 
     [exec] <http://ci.phpmyadmin.net/job/phpMyAdmin-continuous/ws/test/selenium/TestBase.php>:101
     [exec] <http://ci.phpmyadmin.net/job/phpMyAdmin-continuous/ws/test/selenium/TestBase.php>:101
     [exec] <http://ci.phpmyadmin.net/job/phpMyAdmin-continuous/ws/test/selenium/PmaSeleniumDbOperationsTest.php>:49
     [exec] 
     [exec] 9) PmaSeleniumDbOperationsTest::testRenameDB
     [exec] PHP_Invoker_TimeoutException: Execution aborted after 3 seconds
     [exec] 
     [exec] <http://ci.phpmyadmin.net/job/phpMyAdmin-continuous/ws/test/selenium/TestBase.php>:105
     [exec] <http://ci.phpmyadmin.net/job/phpMyAdmin-continuous/ws/test/selenium/TestBase.php>:105
     [exec] <http://ci.phpmyadmin.net/job/phpMyAdmin-continuous/ws/test/selenium/PmaSeleniumDbOperationsTest.php>:49
     [exec] 
     [exec] 10) PmaSeleniumDbOperationsTest::testCopyDb
     [exec] PHP_Invoker_TimeoutException: Execution aborted after 3 seconds
     [exec] 
     [exec] <http://ci.phpmyadmin.net/job/phpMyAdmin-continuous/ws/test/selenium/TestBase.php>:101
     [exec] <http://ci.phpmyadmin.net/job/phpMyAdmin-continuous/ws/test/selenium/TestBase.php>:101
     [exec] <http://ci.phpmyadmin.net/job/phpMyAdmin-continuous/ws/test/selenium/PmaSeleniumDbOperationsTest.php>:49
     [exec] 
     [exec] There were 5 incomplete tests:
     [exec] 
     [exec] 1) PMA_ConfigTest::testCheckPermissions
     [exec] This test has not been implemented yet.
     [exec] 
     [exec] <http://ci.phpmyadmin.net/job/phpMyAdmin-continuous/ws/test/classes/PMA_Config_test.php>:956
     [exec] 
     [exec] 2) PMA_DisplayResults_Test::testGetTableNavigation with data set #0 (21, 41, '123', false, '310')
     [exec] Not yet implemented!
     [exec] 
     [exec] <http://ci.phpmyadmin.net/job/phpMyAdmin-continuous/ws/test/classes/PMA_DisplayResults_test.php>:438
     [exec] 
     [exec] 3) PMA_AuthenticationCookie_Test::testBlowfishDecrypt
     [exec] Not testing mcrypt support
     [exec] 
     [exec] <http://ci.phpmyadmin.net/job/phpMyAdmin-continuous/ws/test/classes/plugin/auth/PMA_AuthenticationCookie_test.php>:1104
     [exec] 
     [exec] 4) PMA_TblColumnsDefinitionFormTest::testGetFormParamsForOldColumn
     [exec] Not yet implemented!
     [exec] 
     [exec] <http://ci.phpmyadmin.net/job/phpMyAdmin-continuous/ws/test/libraries/PMA_tbl_columns_definition_form_test.php>:1101
     [exec] 
     [exec] 5) Environment_Test::testSession
     [exec] No session testing
     [exec] 
     [exec] <http://ci.phpmyadmin.net/job/phpMyAdmin-continuous/ws/test/Environment_test.php>:83
     [exec] 
     [exec] --
     [exec] 
     [exec] 
     [exec] There was 1 skipped test:
     [exec] 
     [exec] 1) Environment_Test::testMySQL
     [exec] Error: SQLSTATE[42000] [1049] Unknown database 'pmatest'
     [exec] 
     [exec] <http://ci.phpmyadmin.net/job/phpMyAdmin-continuous/ws/test/Environment_test.php>:62
     [exec] 
     [exec] FAILURES!
     [exec] Tests: 2226, Assertions: 5379, Errors: 10, Incomplete: 5, Skipped: 1.
     [exec] 

BUILD FAILED
<http://ci.phpmyadmin.net/job/phpMyAdmin-continuous/ws/build.xml>:30: exec returned: 2

Total time: 7 minutes 6 seconds
Build step 'Invoke Ant' marked build as failure
[CHECKSTYLE] Skipping publisher since build result is FAILURE
[JSLINT] Skipping publisher since build result is FAILURE
[PMD] Skipping publisher since build result is FAILURE
[DRY] Collecting duplicate code analysis files...
[DRY] Finding all files that match the pattern build/logs/pmd-cpd.xml
[DRY] Computing warning deltas based on reference build #5461
[TASKS] Skipping publisher since build result is FAILURE
[ANALYSIS-COLLECTOR] Computing warning deltas based on reference build #5461
Recording plot data
[xUnit] [INFO] - Starting to record.
[xUnit] [INFO] - Processing PHPUnit-3.x (default)
[xUnit] [INFO] - [PHPUnit-3.x (default)] - 1 test report file(s) were found with the pattern 'build/logs/junit.xml' relative to '<http://ci.phpmyadmin.net/job/phpMyAdmin-continuous/ws/'> for the testing framework 'PHPUnit-3.x (default)'.
[xUnit] [INFO] - Check 'Failed Tests' threshold.
[xUnit] [INFO] - Check 'Skipped Tests' threshold.
[xUnit] [INFO] - Setting the build status to FAILURE
[xUnit] [INFO] - Stopping recording.




More information about the Developers mailing list