[Phpmyadmin-devel] Build failed in Jenkins: phpMyAdmin-continuous #5511

michal at cihar.com michal at cihar.com
Tue Feb 18 10:08:07 CET 2014


See <http://ci.phpmyadmin.net/job/phpMyAdmin-continuous/5511/changes>

Changes:

[Michal Čihař] Skip user creating test if there are no privileges for that

------------------------------------------
[...truncated 353 lines...]
     [exec] <http://ci.phpmyadmin.net/job/phpMyAdmin-continuous/ws/test/selenium/PmaSeleniumTableBrowseTest.php>:215
     [exec] 
     [exec] 19) PMA_SeleniumTableCreateTest::testCreateTable
     [exec] PHP_Invoker_TimeoutException: Execution aborted after 3 seconds
     [exec] 
     [exec] <http://ci.phpmyadmin.net/job/phpMyAdmin-continuous/ws/test/selenium/TestBase.php>:217
     [exec] <http://ci.phpmyadmin.net/job/phpMyAdmin-continuous/ws/test/selenium/TestBase.php>:217
     [exec] <http://ci.phpmyadmin.net/job/phpMyAdmin-continuous/ws/test/selenium/PmaSeleniumTableCreateTest.php>:27
     [exec] 
     [exec] 20) PMA_SeleniumTableInsertTest::testAddData
     [exec] PHP_Invoker_TimeoutException: Execution aborted after 3 seconds
     [exec] 
     [exec] <http://ci.phpmyadmin.net/job/phpMyAdmin-continuous/ws/test/selenium/TestBase.php>:217
     [exec] <http://ci.phpmyadmin.net/job/phpMyAdmin-continuous/ws/test/selenium/TestBase.php>:217
     [exec] <http://ci.phpmyadmin.net/job/phpMyAdmin-continuous/ws/test/selenium/PmaSeleniumTableInsertTest.php>:47
     [exec] 
     [exec] 21) PMA_SeleniumTableOperationsTest::testChangeTableOrder
     [exec] PHPUnit_Extensions_Selenium2TestCase_WebDriverException: no such element
     [exec]   (Session info: chrome=32.0.1700.76)
     [exec]   (Driver info: chromedriver=2.9.248315,platform=Windows NT 5.2 SP2 x86) (WARNING: The server did not provide any stacktrace information)
     [exec] Command duration or timeout: 10.02 seconds
     [exec] For documentation on this error, please visit: http://seleniumhq.org/exceptions/no_such_element.html
     [exec] Build info: version: '2.39.0', revision: 'ff23eac', time: '2013-12-16 16:11:15'
     [exec] System info: host: 'ip-0A7639FA', ip: '185.44.128.19', os.name: 'windows', os.arch: 'x86', os.version: '5.2', java.version: '1.7.0_45'
     [exec] Session ID: c52a067032d0f0cc35800a825e7c1d68
     [exec] Driver info: org.openqa.selenium.chrome.ChromeDriver
     [exec] Capabilities [{platform=XP, acceptSslCerts=true, javascriptEnabled=true, browserName=chrome, chrome={userDataDir=C:\Windows\proxy\scoped_dir5916_12600}, rotatable=false, locationContextEnabled=true, version=32.0.1700.76, takesHeapSnapshot=true, cssSelectorsEnabled=true, databaseEnabled=false, handlesAlerts=true, browserConnectionEnabled=false, nativeEvents=true, webStorageEnabled=true, applicationCacheEnabled=false, takesScreenshot=true}]
     [exec] 
     [exec] <http://ci.phpmyadmin.net/job/phpMyAdmin-continuous/ws/test/selenium/TestBase.php>:314
     [exec] <http://ci.phpmyadmin.net/job/phpMyAdmin-continuous/ws/test/selenium/PmaSeleniumTableOperationsTest.php>:62
     [exec] 
     [exec] 22) PMA_SeleniumTableOperationsTest::testMoveTable
     [exec] PHPUnit_Extensions_Selenium2TestCase_WebDriverException: no such element
     [exec]   (Session info: chrome=32.0.1700.76)
     [exec]   (Driver info: chromedriver=2.9.248315,platform=Windows NT 6.2 x86_64) (WARNING: The server did not provide any stacktrace information)
     [exec] Command duration or timeout: 10.05 seconds
     [exec] For documentation on this error, please visit: http://seleniumhq.org/exceptions/no_such_element.html
     [exec] Build info: version: '2.39.0', revision: 'ff23eac', time: '2013-12-16 16:11:15'
     [exec] System info: host: 'AMAZONA-TO69SD6', ip: '185.44.128.56', os.name: 'windows', os.arch: 'x86', os.version: '6.2', java.version: '1.7.0_45'
     [exec] Session ID: 9ac3cc4d48b1bf9454cdc1c2c30d056f
     [exec] Driver info: org.openqa.selenium.chrome.ChromeDriver
     [exec] Capabilities [{platform=WIN8, acceptSslCerts=true, javascriptEnabled=true, browserName=chrome, chrome={userDataDir=C:\Windows\proxy\scoped_dir3444_2616}, rotatable=false, locationContextEnabled=true, version=32.0.1700.76, takesHeapSnapshot=true, cssSelectorsEnabled=true, databaseEnabled=false, handlesAlerts=true, browserConnectionEnabled=false, nativeEvents=true, webStorageEnabled=true, applicationCacheEnabled=false, takesScreenshot=true}]
     [exec] 
     [exec] <http://ci.phpmyadmin.net/job/phpMyAdmin-continuous/ws/test/selenium/TestBase.php>:314
     [exec] <http://ci.phpmyadmin.net/job/phpMyAdmin-continuous/ws/test/selenium/PmaSeleniumTableOperationsTest.php>:62
     [exec] 
     [exec] 23) PMA_SeleniumTableOperationsTest::testRenameTable
     [exec] PHPUnit_Extensions_Selenium2TestCase_WebDriverException: no such element
     [exec]   (Session info: chrome=32.0.1700.76)
     [exec]   (Driver info: chromedriver=2.9.248315,platform=Windows NT 6.3 x86_64) (WARNING: The server did not provide any stacktrace information)
     [exec] Command duration or timeout: 10.03 seconds
     [exec] For documentation on this error, please visit: http://seleniumhq.org/exceptions/no_such_element.html
     [exec] Build info: version: '2.39.0', revision: 'ff23eac', time: '2013-12-16 16:11:15'
     [exec] System info: host: 'AMAZONA-TO69SD6', ip: '5.255.93.56', os.name: 'windows', os.arch: 'x86', os.version: '6.2', java.version: '1.7.0_45'
     [exec] Session ID: 5b78e335fb49cd8997e1a1cd30f4a14f
     [exec] Driver info: org.openqa.selenium.chrome.ChromeDriver
     [exec] Capabilities [{platform=WIN8, acceptSslCerts=true, javascriptEnabled=true, browserName=chrome, chrome={userDataDir=C:\Windows\proxy\scoped_dir3308_25340}, rotatable=false, locationContextEnabled=true, version=32.0.1700.76, takesHeapSnapshot=true, cssSelectorsEnabled=true, databaseEnabled=false, handlesAlerts=true, browserConnectionEnabled=false, nativeEvents=true, webStorageEnabled=true, applicationCacheEnabled=false, takesScreenshot=true}]
     [exec] 
     [exec] <http://ci.phpmyadmin.net/job/phpMyAdmin-continuous/ws/test/selenium/TestBase.php>:314
     [exec] <http://ci.phpmyadmin.net/job/phpMyAdmin-continuous/ws/test/selenium/PmaSeleniumTableOperationsTest.php>:62
     [exec] 
     [exec] 24) PMA_SeleniumTableOperationsTest::testCopyTable
     [exec] PHPUnit_Extensions_Selenium2TestCase_WebDriverException: no such element
     [exec]   (Session info: chrome=32.0.1700.76)
     [exec]   (Driver info: chromedriver=2.9.248315,platform=Windows NT 6.0 SP2 x86) (WARNING: The server did not provide any stacktrace information)
     [exec] Command duration or timeout: 10.03 seconds
     [exec] For documentation on this error, please visit: http://seleniumhq.org/exceptions/no_such_element.html
     [exec] Build info: version: '2.39.0', revision: 'ff23eac', time: '2013-12-16 16:11:15'
     [exec] System info: host: 'ip-0AF24655', ip: '185.44.128.145', os.name: 'windows', os.arch: 'x86', os.version: '6.0', java.version: '1.7.0_45'
     [exec] Session ID: 14998915a405aa6d70d626d287ac832f
     [exec] Driver info: org.openqa.selenium.chrome.ChromeDriver
     [exec] Capabilities [{platform=XP, acceptSslCerts=true, javascriptEnabled=true, browserName=chrome, chrome={userDataDir=C:\Windows\proxy\scoped_dir824_8219}, rotatable=false, locationContextEnabled=true, version=32.0.1700.76, takesHeapSnapshot=true, cssSelectorsEnabled=true, databaseEnabled=false, handlesAlerts=true, browserConnectionEnabled=false, nativeEvents=true, webStorageEnabled=true, applicationCacheEnabled=false, takesScreenshot=true}]
     [exec] 
     [exec] <http://ci.phpmyadmin.net/job/phpMyAdmin-continuous/ws/test/selenium/TestBase.php>:314
     [exec] <http://ci.phpmyadmin.net/job/phpMyAdmin-continuous/ws/test/selenium/PmaSeleniumTableOperationsTest.php>:62
     [exec] 
     [exec] 25) PMA_SeleniumTableOperationsTest::testTruncateTable
     [exec] PHPUnit_Extensions_Selenium2TestCase_WebDriverException: no such element
     [exec]   (Session info: chrome=32.0.1700.76)
     [exec]   (Driver info: chromedriver=2.9.248315,platform=Windows NT 5.2 SP2 x86) (WARNING: The server did not provide any stacktrace information)
     [exec] Command duration or timeout: 10.02 seconds
     [exec] For documentation on this error, please visit: http://seleniumhq.org/exceptions/no_such_element.html
     [exec] Build info: version: '2.39.0', revision: 'ff23eac', time: '2013-12-16 16:11:15'
     [exec] System info: host: 'ip-0A7639FA', ip: '185.44.128.15', os.name: 'windows', os.arch: 'x86', os.version: '5.2', java.version: '1.7.0_45'
     [exec] Session ID: 107e8d89455d1a48e9a9effdc35464c4
     [exec] Driver info: org.openqa.selenium.chrome.ChromeDriver
     [exec] Capabilities [{platform=XP, acceptSslCerts=true, javascriptEnabled=true, browserName=chrome, chrome={userDataDir=C:\Windows\proxy\scoped_dir3780_15133}, rotatable=false, locationContextEnabled=true, version=32.0.1700.76, takesHeapSnapshot=true, cssSelectorsEnabled=true, databaseEnabled=false, handlesAlerts=true, browserConnectionEnabled=false, nativeEvents=true, webStorageEnabled=true, applicationCacheEnabled=false, takesScreenshot=true}]
     [exec] 
     [exec] <http://ci.phpmyadmin.net/job/phpMyAdmin-continuous/ws/test/selenium/TestBase.php>:314
     [exec] <http://ci.phpmyadmin.net/job/phpMyAdmin-continuous/ws/test/selenium/PmaSeleniumTableOperationsTest.php>:62
     [exec] 
     [exec] 26) PMA_SeleniumTableOperationsTest::testDropTable
     [exec] PHPUnit_Extensions_Selenium2TestCase_WebDriverException: no such element
     [exec]   (Session info: chrome=32.0.1700.76)
     [exec]   (Driver info: chromedriver=2.9.248315,platform=Windows NT 6.0 SP2 x86) (WARNING: The server did not provide any stacktrace information)
     [exec] Command duration or timeout: 10.01 seconds
     [exec] For documentation on this error, please visit: http://seleniumhq.org/exceptions/no_such_element.html
     [exec] Build info: version: '2.39.0', revision: 'ff23eac', time: '2013-12-16 16:11:15'
     [exec] System info: host: 'ip-0AF24655', ip: '5.255.93.88', os.name: 'windows', os.arch: 'x86', os.version: '6.0', java.version: '1.7.0_45'
     [exec] Session ID: 62a1f5a596e784b0ccc17cd71b27f1de
     [exec] Driver info: org.openqa.selenium.chrome.ChromeDriver
     [exec] Capabilities [{platform=XP, acceptSslCerts=true, javascriptEnabled=true, browserName=chrome, chrome={userDataDir=C:\Windows\proxy\scoped_dir308_29980}, rotatable=false, locationContextEnabled=true, version=32.0.1700.76, takesHeapSnapshot=true, cssSelectorsEnabled=true, databaseEnabled=false, handlesAlerts=true, browserConnectionEnabled=false, nativeEvents=true, webStorageEnabled=true, applicationCacheEnabled=false, takesScreenshot=true}]
     [exec] 
     [exec] <http://ci.phpmyadmin.net/job/phpMyAdmin-continuous/ws/test/selenium/TestBase.php>:314
     [exec] <http://ci.phpmyadmin.net/job/phpMyAdmin-continuous/ws/test/selenium/PmaSeleniumTableOperationsTest.php>:62
     [exec] 
     [exec] 27) PMA_SeleniumTableStructureTest::testChangeColumn
     [exec] PHPUnit_Extensions_Selenium2TestCase_WebDriverException: stale element reference: element is not attached to the page document
     [exec]   (Session info: chrome=32.0.1700.76)
     [exec]   (Driver info: chromedriver=2.9.248315,platform=Windows NT 5.2 SP2 x86) (WARNING: The server did not provide any stacktrace information)
     [exec] Command duration or timeout: 32 milliseconds
     [exec] For documentation on this error, please visit: http://seleniumhq.org/exceptions/stale_element_reference.html
     [exec] Build info: version: '2.39.0', revision: 'ff23eac', time: '2013-12-16 16:11:15'
     [exec] System info: host: 'ip-0A7639FA', ip: '5.255.93.50', os.name: 'windows', os.arch: 'x86', os.version: '5.2', java.version: '1.7.0_45'
     [exec] Session ID: f4c3120098f469051769bc56535fc78e
     [exec] Driver info: org.openqa.selenium.chrome.ChromeDriver
     [exec] Capabilities [{platform=XP, acceptSslCerts=true, javascriptEnabled=true, browserName=chrome, chrome={userDataDir=C:\Windows\proxy\scoped_dir2156_27481}, rotatable=false, locationContextEnabled=true, version=32.0.1700.76, takesHeapSnapshot=true, cssSelectorsEnabled=true, databaseEnabled=false, handlesAlerts=true, browserConnectionEnabled=false, nativeEvents=true, webStorageEnabled=true, applicationCacheEnabled=false, takesScreenshot=true}]
     [exec] 
     [exec] <http://ci.phpmyadmin.net/job/phpMyAdmin-continuous/ws/test/selenium/PmaSeleniumTableStructureTest.php>:119
     [exec] <http://ci.phpmyadmin.net/job/phpMyAdmin-continuous/ws/test/selenium/PmaSeleniumTableStructureTest.php>:119
     [exec] 
     [exec] 28) PMA_SeleniumTrackingTest::testTrackingData
     [exec] PHPUnit_Extensions_Selenium2TestCase_WebDriverException: no such element
     [exec]   (Session info: chrome=32.0.1700.76)
     [exec]   (Driver info: chromedriver=2.9.248315,platform=Windows NT 5.2 SP2 x86) (WARNING: The server did not provide any stacktrace information)
     [exec] Command duration or timeout: 109 milliseconds
     [exec] For documentation on this error, please visit: http://seleniumhq.org/exceptions/no_such_element.html
     [exec] Build info: version: '2.39.0', revision: 'ff23eac', time: '2013-12-16 16:11:15'
     [exec] System info: host: 'ip-0A7639FA', ip: '185.44.128.98', os.name: 'windows', os.arch: 'x86', os.version: '5.2', java.version: '1.7.0_45'
     [exec] Session ID: aaf1eb93296c7ea9a2721daa1d1707c3
     [exec] Driver info: org.openqa.selenium.chrome.ChromeDriver
     [exec] Capabilities [{platform=XP, acceptSslCerts=true, javascriptEnabled=true, browserName=chrome, chrome={userDataDir=C:\Windows\proxy\scoped_dir2452_16792}, rotatable=false, locationContextEnabled=true, version=32.0.1700.76, takesHeapSnapshot=true, cssSelectorsEnabled=true, databaseEnabled=false, handlesAlerts=true, browserConnectionEnabled=false, nativeEvents=true, webStorageEnabled=true, applicationCacheEnabled=false, takesScreenshot=true}]
     [exec] 
     [exec] <http://ci.phpmyadmin.net/job/phpMyAdmin-continuous/ws/test/selenium/PmaSeleniumTrackingTest.php>:62
     [exec] <http://ci.phpmyadmin.net/job/phpMyAdmin-continuous/ws/test/selenium/PmaSeleniumTrackingTest.php>:62
     [exec] 
     [exec] 29) PMA_SeleniumTrackingTest::testDeactivateTracking
     [exec] PHPUnit_Extensions_Selenium2TestCase_WebDriverException: no such element
     [exec]   (Session info: chrome=32.0.1700.76)
     [exec]   (Driver info: chromedriver=2.9.248315,platform=Windows NT 6.1 SP1 x86_64) (WARNING: The server did not provide any stacktrace information)
     [exec] Command duration or timeout: 117 milliseconds
     [exec] For documentation on this error, please visit: http://seleniumhq.org/exceptions/no_such_element.html
     [exec] Build info: version: '2.39.0', revision: 'ff23eac', time: '2013-12-16 16:11:15'
     [exec] System info: host: 'AMAZONA-FJ6TK7R', ip: '5.255.92.202', os.name: 'windows', os.arch: 'x86', os.version: '6.1', java.version: '1.7.0_45'
     [exec] Session ID: d67dbf1ee0ed4505ac56acbdb57669aa
     [exec] Driver info: org.openqa.selenium.chrome.ChromeDriver
     [exec] Capabilities [{platform=XP, acceptSslCerts=true, javascriptEnabled=true, browserName=chrome, chrome={userDataDir=C:\Windows\proxy\scoped_dir256_5037}, rotatable=false, locationContextEnabled=true, version=32.0.1700.76, takesHeapSnapshot=true, cssSelectorsEnabled=true, databaseEnabled=false, handlesAlerts=true, browserConnectionEnabled=false, nativeEvents=true, webStorageEnabled=true, applicationCacheEnabled=false, takesScreenshot=true}]
     [exec] 
     [exec] <http://ci.phpmyadmin.net/job/phpMyAdmin-continuous/ws/test/selenium/PmaSeleniumTrackingTest.php>:62
     [exec] <http://ci.phpmyadmin.net/job/phpMyAdmin-continuous/ws/test/selenium/PmaSeleniumTrackingTest.php>:62
     [exec] 
     [exec] 30) PMA_SeleniumTrackingTest::testDropTracking
     [exec] PHPUnit_Extensions_Selenium2TestCase_WebDriverException: no such element
     [exec]   (Session info: chrome=32.0.1700.76)
     [exec]   (Driver info: chromedriver=2.9.248315,platform=Windows NT 6.0 SP2 x86) (WARNING: The server did not provide any stacktrace information)
     [exec] Command duration or timeout: 112 milliseconds
     [exec] For documentation on this error, please visit: http://seleniumhq.org/exceptions/no_such_element.html
     [exec] Build info: version: '2.39.0', revision: 'ff23eac', time: '2013-12-16 16:11:15'
     [exec] System info: host: 'ip-0AF24655', ip: '5.255.93.69', os.name: 'windows', os.arch: 'x86', os.version: '6.0', java.version: '1.7.0_45'
     [exec] Session ID: 5064c30ff4493560da2feff187a4432c
     [exec] Driver info: org.openqa.selenium.chrome.ChromeDriver
     [exec] Capabilities [{platform=XP, acceptSslCerts=true, javascriptEnabled=true, browserName=chrome, chrome={userDataDir=C:\Windows\proxy\scoped_dir6044_8684}, rotatable=false, locationContextEnabled=true, version=32.0.1700.76, takesHeapSnapshot=true, cssSelectorsEnabled=true, databaseEnabled=false, handlesAlerts=true, browserConnectionEnabled=false, nativeEvents=true, webStorageEnabled=true, applicationCacheEnabled=false, takesScreenshot=true}]
     [exec] 
     [exec] <http://ci.phpmyadmin.net/job/phpMyAdmin-continuous/ws/test/selenium/PmaSeleniumTrackingTest.php>:62
     [exec] <http://ci.phpmyadmin.net/job/phpMyAdmin-continuous/ws/test/selenium/PmaSeleniumTrackingTest.php>:62
     [exec] 
     [exec] 31) PMA_SeleniumTrackingTest::testStructureSnapshot
     [exec] PHPUnit_Extensions_Selenium2TestCase_WebDriverException: no such element
     [exec]   (Session info: chrome=32.0.1700.76)
     [exec]   (Driver info: chromedriver=2.9.248315,platform=Windows NT 5.2 SP2 x86) (WARNING: The server did not provide any stacktrace information)
     [exec] Command duration or timeout: 110 milliseconds
     [exec] For documentation on this error, please visit: http://seleniumhq.org/exceptions/no_such_element.html
     [exec] Build info: version: '2.39.0', revision: 'ff23eac', time: '2013-12-16 16:11:15'
     [exec] System info: host: 'ip-0A7639FA', ip: '5.255.93.27', os.name: 'windows', os.arch: 'x86', os.version: '5.2', java.version: '1.7.0_45'
     [exec] Session ID: d3a035d44dfe9d0d9c716e7e463ae811
     [exec] Driver info: org.openqa.selenium.chrome.ChromeDriver
     [exec] Capabilities [{platform=XP, acceptSslCerts=true, javascriptEnabled=true, browserName=chrome, chrome={userDataDir=C:\Windows\proxy\scoped_dir3100_20647}, rotatable=false, locationContextEnabled=true, version=32.0.1700.76, takesHeapSnapshot=true, cssSelectorsEnabled=true, databaseEnabled=false, handlesAlerts=true, browserConnectionEnabled=false, nativeEvents=true, webStorageEnabled=true, applicationCacheEnabled=false, takesScreenshot=true}]
     [exec] 
     [exec] <http://ci.phpmyadmin.net/job/phpMyAdmin-continuous/ws/test/selenium/PmaSeleniumTrackingTest.php>:62
     [exec] <http://ci.phpmyadmin.net/job/phpMyAdmin-continuous/ws/test/selenium/PmaSeleniumTrackingTest.php>:62
     [exec] 
     [exec] There were 5 incomplete tests:
     [exec] 
     [exec] 1) PMA_ConfigTest::testCheckPermissions
     [exec] This test has not been implemented yet.
     [exec] 
     [exec] <http://ci.phpmyadmin.net/job/phpMyAdmin-continuous/ws/test/classes/PMA_Config_test.php>:956
     [exec] 
     [exec] 2) PMA_DisplayResults_Test::testGetTableNavigation with data set #0 (21, 41, '123', false, '310')
     [exec] Not yet implemented!
     [exec] 
     [exec] <http://ci.phpmyadmin.net/job/phpMyAdmin-continuous/ws/test/classes/PMA_DisplayResults_test.php>:438
     [exec] 
     [exec] 3) PMA_AuthenticationCookie_Test::testBlowfishDecrypt
     [exec] Not testing mcrypt support
     [exec] 
     [exec] <http://ci.phpmyadmin.net/job/phpMyAdmin-continuous/ws/test/classes/plugin/auth/PMA_AuthenticationCookie_test.php>:1104
     [exec] 
     [exec] 4) PMA_TblColumnsDefinitionFormTest::testGetFormParamsForOldColumn
     [exec] Not yet implemented!
     [exec] 
     [exec] <http://ci.phpmyadmin.net/job/phpMyAdmin-continuous/ws/test/libraries/PMA_tbl_columns_definition_form_test.php>:1101
     [exec] 
     [exec] 5) Environment_Test::testSession
     [exec] No session testing
     [exec] 
     [exec] <http://ci.phpmyadmin.net/job/phpMyAdmin-continuous/ws/test/Environment_test.php>:83
     [exec] 
     [exec] --
     [exec] 
     [exec] 
     [exec] There were 2 skipped tests:
     [exec] 
     [exec] 1) Environment_Test::testMySQL
     [exec] Error: SQLSTATE[42000] [1049] Unknown database 'pmatest'
     [exec] 
     [exec] <http://ci.phpmyadmin.net/job/phpMyAdmin-continuous/ws/test/Environment_test.php>:62
     [exec] 
     [exec] 2) PMA_SeleniumCreateRemoveUserTest::testCreateRemoveUser
     [exec] Test user is not a superuser.
     [exec] 
     [exec] <http://ci.phpmyadmin.net/job/phpMyAdmin-continuous/ws/test/selenium/TestBase.php>:183
     [exec] <http://ci.phpmyadmin.net/job/phpMyAdmin-continuous/ws/test/selenium/PmaSeleniumCreateRemoveUserTest.php>:44
     [exec] 
     [exec] FAILURES!
     [exec] Tests: 2258, Assertions: 5414, Errors: 31, Incomplete: 5, Skipped: 2.
     [exec] 

BUILD FAILED
<http://ci.phpmyadmin.net/job/phpMyAdmin-continuous/ws/build.xml>:30: exec returned: 2

Total time: 15 minutes 57 seconds
Build step 'Invoke Ant' marked build as failure
[CHECKSTYLE] Skipping publisher since build result is FAILURE
[JSLINT] Skipping publisher since build result is FAILURE
[PMD] Skipping publisher since build result is FAILURE
[DRY] Collecting duplicate code analysis files...
[DRY] Finding all files that match the pattern build/logs/pmd-cpd.xml
[DRY] Computing warning deltas based on reference build #5493
[TASKS] Skipping publisher since build result is FAILURE
[ANALYSIS-COLLECTOR] Computing warning deltas based on reference build #5493
Recording plot data
[xUnit] [INFO] - Starting to record.
[xUnit] [INFO] - Processing PHPUnit-3.x (default)
[xUnit] [INFO] - [PHPUnit-3.x (default)] - 1 test report file(s) were found with the pattern 'build/logs/junit.xml' relative to '<http://ci.phpmyadmin.net/job/phpMyAdmin-continuous/ws/'> for the testing framework 'PHPUnit-3.x (default)'.
[xUnit] [INFO] - Check 'Failed Tests' threshold.
[xUnit] [INFO] - Check 'Skipped Tests' threshold.
[xUnit] [INFO] - Setting the build status to FAILURE
[xUnit] [INFO] - Stopping recording.




More information about the Developers mailing list