[phpMyAdmin Developers] Build failed in Jenkins: phpMyAdmin-error-reporting-server #137

Jenkins Daemon jenkins at phpmyadmin.net
Wed Jan 27 12:24:16 CET 2016


See <https://ci.phpmyadmin.net/job/phpMyAdmin-error-reporting-server/137/>

------------------------------------------
Started by user Michal Čihař
[EnvInject] - Loading node environment variables.
Building in workspace <https://ci.phpmyadmin.net/job/phpMyAdmin-error-reporting-server/ws/>
 > git rev-parse --is-inside-work-tree # timeout=10
Fetching changes from the remote Git repository
 > git config remote.origin.url git://github.com/phpmyadmin/error-reporting-server.git # timeout=10
Fetching upstream changes from git://github.com/phpmyadmin/error-reporting-server.git
 > git --version # timeout=10
 > git -c core.askpass=true fetch --tags --progress git://github.com/phpmyadmin/error-reporting-server.git +refs/heads/*:refs/remotes/origin/*
 > git rev-parse origin/master^{commit} # timeout=10
Checking out Revision 08427569b0ede36f543241a5fe2de55b96fff6bb (origin/master)
 > git config core.sparsecheckout # timeout=10
 > git checkout -f 08427569b0ede36f543241a5fe2de55b96fff6bb
 > git rev-list 08427569b0ede36f543241a5fe2de55b96fff6bb # timeout=10
[workspace] $ /bin/sh -xe /tmp/hudson3972957447918840347.sh
+ mysql -utravis -e DROP DATABASE IF EXIST pmaerr
ERROR 1064 (42000) at line 1: You have an error in your SQL syntax; check the manual that corresponds to your MySQL server version for the right syntax to use near 'EXIST pmaerr' at line 1
Build step 'Execute shell' marked build as failure
[CHECKSTYLE] Skipping publisher since build result is FAILURE
[JSLINT] Skipping publisher since build result is FAILURE
[PMD] Skipping publisher since build result is FAILURE
[DRY] Skipping publisher since build result is FAILURE
[TASKS] Skipping publisher since build result is FAILURE
[ANALYSIS-COLLECTOR] Skipping publisher since build result is FAILURE
[xUnit] [INFO] - Starting to record.
[xUnit] [INFO] - Processing PHPUnit-3.x (default)
[xUnit] [INFO] - [PHPUnit-3.x (default)] - No test report file(s) were found with the pattern 'build/logs/clover.xml' relative to '<https://ci.phpmyadmin.net/job/phpMyAdmin-error-reporting-server/ws/'> for the testing framework 'PHPUnit-3.x (default)'.  Did you enter a pattern relative to the correct directory?  Did you generate the result report(s) for 'PHPUnit-3.x (default)'?
[xUnit] [ERROR] - No test reports found for the metric 'PHPUnit' with the resolved pattern 'build/logs/clover.xml'. Configuration error?.
[xUnit] [INFO] - Failing BUILD.
[xUnit] [INFO] - There are errors when processing test results.
[xUnit] [INFO] - Skipping tests recording.
[xUnit] [INFO] - Stop build.



More information about the Developers mailing list