[phpMyAdmin Developers] Build failed in Jenkins: phpMyAdmin #2325

Jenkins Daemon jenkins at phpmyadmin.net
Mon Dec 18 04:57:26 CET 2017

See <https://ci.phpmyadmin.net/job/phpMyAdmin/2325/display/redirect?page=changes>


[mauriciofauth] Use template for _getResultsRow method

[mauriciofauth] Use template for getResultDivs method

[mauriciofauth] Remove underscores from methods and properties names

[mauriciofauth] Use template for getSelectionForm method

[mauriciofauth] Use template for getSearchResults method

[weblate] Translated using Weblate (Italian)

[weblate] Translated using Weblate (Russian)

[mauriciofauth] Remove table from database search form

Started by timer
[EnvInject] - Loading node environment variables.
Building in workspace <https://ci.phpmyadmin.net/job/phpMyAdmin/ws/>
 > git rev-parse --is-inside-work-tree # timeout=10
Fetching changes from the remote Git repository
 > git config remote.origin.url https://github.com/phpmyadmin/phpmyadmin.git # timeout=10
Fetching upstream changes from https://github.com/phpmyadmin/phpmyadmin.git
 > git --version # timeout=10
 > git fetch --tags --progress https://github.com/phpmyadmin/phpmyadmin.git +refs/heads/*:refs/remotes/origin/*
 > git rev-parse origin/master^{commit} # timeout=10
Checking out Revision 92f71ba0bcfac5a6247e5abc3e794a985b874e7f (origin/master)
Commit message: "Remove table from database search form"
 > git config core.sparsecheckout # timeout=10
 > git checkout -f 92f71ba0bcfac5a6247e5abc3e794a985b874e7f
 > git rev-list bed0448405ef63aacf32f32f5eec5719c9619367 # timeout=10
[EnvInject] - Executing scripts and injecting environment variables after the SCM step.
[EnvInject] - Injecting as environment variables the properties content 

[EnvInject] - Variables injected successfully.
[workspace] $ /bin/sh -xe /tmp/jenkins276155631642643799.sh
+ composer update --no-interaction
Loading composer repositories with package information
Updating dependencies (including require-dev)
Package operations: 0 installs, 2 updates, 0 removals
  - Updating phpunit/phpunit (5.7.25 => 5.7.26): Loading from cache
  - Updating squizlabs/php_codesniffer (3.2.0 => 3.2.1): Downloading (connecting...)Downloading (0%)           Downloading (5%)Downloading (10%)Downloading (15%)Downloading (20%)Downloading (25%)Downloading (30%)Downloading (35%)Downloading (40%)Downloading (45%)Downloading (50%)Downloading (55%)Downloading (60%)Downloading (65%)Downloading (70%)Downloading (75%)Downloading (80%)Downloading (85%)Downloading (90%)Downloading (95%)Downloading (100%)
Writing lock file
Generating autoload files
[workspace] $ ant ******** ******** clean locales phpunit pdepend phpmd phpcpd phpcs phploc jshint jshint-checkstyle lint
Unable to locate tools.jar. Expected to find it in /usr/lib/jvm/java-8-openjdk-amd64/lib/tools.jar
Buildfile: <https://ci.phpmyadmin.net/job/phpMyAdmin/ws/build.xml>

   [delete] Deleting directory <https://ci.phpmyadmin.net/job/phpMyAdmin/ws/build/api>
   [delete] Deleting directory <https://ci.phpmyadmin.net/job/phpMyAdmin/ws/build/code-browser>
   [delete] Deleting directory <https://ci.phpmyadmin.net/job/phpMyAdmin/ws/build/coverage>
   [delete] Deleting directory <https://ci.phpmyadmin.net/job/phpMyAdmin/ws/build/logs>
   [delete] Deleting directory <https://ci.phpmyadmin.net/job/phpMyAdmin/ws/build/pdepend>
    [mkdir] Created dir: <https://ci.phpmyadmin.net/job/phpMyAdmin/ws/build/api>
    [mkdir] Created dir: <https://ci.phpmyadmin.net/job/phpMyAdmin/ws/build/code-browser>
    [mkdir] Created dir: <https://ci.phpmyadmin.net/job/phpMyAdmin/ws/build/coverage>
    [mkdir] Created dir: <https://ci.phpmyadmin.net/job/phpMyAdmin/ws/build/logs>
    [mkdir] Created dir: <https://ci.phpmyadmin.net/job/phpMyAdmin/ws/build/pdepend>


     [exec] PHP Fatal error:  Uncaught PHPUnit_Framework_Exception: Class "PHPUnit_Extensions_SeleniumTestSuite" does not extend PHPUnit_Framework_TestCase.
     [exec]   thrown in <https://ci.phpmyadmin.net/job/phpMyAdmin/ws/vendor/phpunit/phpunit/src/Framework/TestSuite.php> on line 147

<https://ci.phpmyadmin.net/job/phpMyAdmin/ws/build.xml>:27: exec returned: 255

Total time: 36 seconds
Build step 'Invoke Ant' marked build as failure
[CHECKSTYLE] Skipping publisher since build result is FAILURE
[JSLINT] Skipping publisher since build result is FAILURE
[PMD] Skipping publisher since build result is FAILURE
[DRY] Collecting duplicate code analysis files...
[DRY] Searching for all files in <https://ci.phpmyadmin.net/job/phpMyAdmin/ws/> that match the pattern build/logs/pmd-cpd.xml
[DRY] No files found. Configuration error?
[DRY] Computing warning deltas based on reference build #2324
[TASKS] Skipping publisher since build result is FAILURE
[ANALYSIS-COLLECTOR] Computing warning deltas based on reference build #2324
Recording plot data
Publishing Clover coverage report...
Clover xml file does not exist in: <https://ci.phpmyadmin.net/job/phpMyAdmin/ws/> called: build/logs/clover.xml and will not be copied to: /var/lib/jenkins/jobs/phpMyAdmin/builds/2325/cloverphp/clover.xml
Could not find 'build/coverage/build/logs/clover.xml'.  Did you generate the XML report for Clover?
[xUnit] [INFO] - Starting to record.
[xUnit] [INFO] - Processing PHPUnit-3.x (default)
[xUnit] [INFO] - [PHPUnit-3.x (default)] - No test report file(s) were found with the pattern 'build/logs/junit.xml' relative to '<https://ci.phpmyadmin.net/job/phpMyAdmin/ws/'> for the testing framework 'PHPUnit-3.x (default)'.  Did you enter a pattern relative to the correct directory?  Did you generate the result report(s) for 'PHPUnit-3.x (default)'?
[xUnit] [ERROR] - No test reports found for the metric 'PHPUnit' with the resolved pattern 'build/logs/junit.xml'. Configuration error?.
[xUnit] [INFO] - Failing BUILD.
[xUnit] [INFO] - There are errors when processing test results.
[xUnit] [INFO] - Skipping tests recording.
[xUnit] [INFO] - Stop build.
[JDepend] JDepend plugin is ready
[JDepend] Couldn't generate JDepend file at 'build/logs/jdepend.xml'java.nio.file.NoSuchFileException: <https://ci.phpmyadmin.net/job/phpMyAdmin/ws/build/logs/jdepend.xml>

More information about the Developers mailing list