[phpMyAdmin Developers] Build failed in Jenkins: phpMyAdmin #2440

Jenkins Daemon jenkins at phpmyadmin.net
Thu Apr 12 04:56:04 CEST 2018

See <https://ci.phpmyadmin.net/job/phpMyAdmin/2440/display/redirect?page=changes>


[Maurício Meneghini Fauth] Refactor PhpMyAdmin\Rte\Events static methods

[Maurício Meneghini Fauth] Refactor PhpMyAdmin\Rte\Triggers static methods

[Maurício Meneghini Fauth] Refactor PhpMyAdmin\Rte\Export static methods

[Maurício Meneghini Fauth] Refactor PhpMyAdmin\Rte\Footer static methods

[Maurício Meneghini Fauth] Refactor PhpMyAdmin\Rte\RteList methods

[Maurício Meneghini Fauth] Refactor PhpMyAdmin\Rte\Words methods

[Maurício Meneghini Fauth] Refactor PhpMyAdmin\Rte\General methods

[weblate] Translated using Weblate (Norwegian Bokmål)

[Maurício Meneghini Fauth] Update master to 5.0.0-dev

[Maurício Meneghini Fauth] Remove homebrew/php from Travis CI

[Maurício Meneghini Fauth] Upgrade to PHP 7.1

Started by timer
[EnvInject] - Loading node environment variables.
Building in workspace <https://ci.phpmyadmin.net/job/phpMyAdmin/ws/>
 > git rev-parse --is-inside-work-tree # timeout=10
Fetching changes from the remote Git repository
 > git config remote.origin.url https://github.com/phpmyadmin/phpmyadmin.git # timeout=10
Fetching upstream changes from https://github.com/phpmyadmin/phpmyadmin.git
 > git --version # timeout=10
 > git fetch --tags --progress https://github.com/phpmyadmin/phpmyadmin.git +refs/heads/*:refs/remotes/origin/*
 > git rev-parse origin/master^{commit} # timeout=10
Checking out Revision f66f04a987e3a089f015d2bcde9493ec7e78489f (origin/master)
 > git config core.sparsecheckout # timeout=10
 > git checkout -f f66f04a987e3a089f015d2bcde9493ec7e78489f
Commit message: "Merge pull request #14186 from mauriciofauth/php71"
 > git rev-list --no-walk ca906c6b788881e382102d620067e4c4d70ce51e # timeout=10
[EnvInject] - Executing scripts and injecting environment variables after the SCM step.
[EnvInject] - Injecting as environment variables the properties content 

[EnvInject] - Variables injected successfully.
[workspace] $ /bin/sh -xe /tmp/jenkins4297477819312801966.sh
+ composer update --no-interaction
Loading composer repositories with package information
Updating dependencies (including require-dev)
Your requirements could not be resolved to an installable set of packages.

  Problem 1
    - This package requires php ^7.1 but your PHP version (7.0.27) does not satisfy that requirement.

Build step 'Execute shell' marked build as failure
[CHECKSTYLE] Skipping publisher since build result is FAILURE
[JSLINT] Skipping publisher since build result is FAILURE
[PMD] Skipping publisher since build result is FAILURE
[DRY] Collecting duplicate code analysis files...
[DRY] Searching for all files in <https://ci.phpmyadmin.net/job/phpMyAdmin/ws/> that match the pattern build/logs/pmd-cpd.xml
[DRY] Parsing 1 file in <https://ci.phpmyadmin.net/job/phpMyAdmin/ws/>
[DRY] Successfully parsed file <https://ci.phpmyadmin.net/job/phpMyAdmin/ws/build/logs/pmd-cpd.xml> with 12 unique warnings and 0 duplicates.
[DRY] Computing warning deltas based on reference build #2439
[TASKS] Skipping publisher since build result is FAILURE
[ANALYSIS-COLLECTOR] Computing warning deltas based on reference build #2439
Recording plot data
Publishing Clover coverage report...
Clover xml file does not exist in: <https://ci.phpmyadmin.net/job/phpMyAdmin/ws/> called: build/logs/clover.xml and will not be copied to: /var/lib/jenkins/jobs/phpMyAdmin/builds/2440/cloverphp/clover.xml
Could not find 'build/coverage/build/logs/clover.xml'.  Did you generate the XML report for Clover?
[xUnit] [INFO] - Starting to record.
[xUnit] [INFO] - Processing PHPUnit-3.x (default)
[xUnit] [INFO] - [PHPUnit-3.x (default)] - 1 test report file(s) were found with the pattern 'build/logs/junit.xml' relative to '<https://ci.phpmyadmin.net/job/phpMyAdmin/ws/'> for the testing framework 'PHPUnit-3.x (default)'.
[xUnit] [ERROR] - Test reports were found but not all of them are new. Did all the tests run?
  * <https://ci.phpmyadmin.net/job/phpMyAdmin/ws/build/logs/junit.xml> is 23 hr old

[xUnit] [INFO] - Failing BUILD.
[xUnit] [INFO] - There are errors when processing test results.
[xUnit] [INFO] - Skipping tests recording.
[xUnit] [INFO] - Stop build.
[JDepend] JDepend plugin is ready
[JDepend] Found 4835 classes in 448 packages

More information about the Developers mailing list