[phpMyAdmin Developers] Build failed in Jenkins: phpMyAdmin #2562

Jenkins Daemon jenkins at phpmyadmin.net
Sat Aug 11 05:56:20 CEST 2018


See <https://ci.phpmyadmin.net/job/phpMyAdmin/2562/display/redirect>

------------------------------------------
Started by timer
[EnvInject] - Loading node environment variables.
Building in workspace <https://ci.phpmyadmin.net/job/phpMyAdmin/ws/>
 > git rev-parse --is-inside-work-tree # timeout=10
Fetching changes from the remote Git repository
 > git config remote.origin.url https://github.com/phpmyadmin/phpmyadmin.git # timeout=10
Fetching upstream changes from https://github.com/phpmyadmin/phpmyadmin.git
 > git --version # timeout=10
 > git fetch --tags --progress https://github.com/phpmyadmin/phpmyadmin.git +refs/heads/*:refs/remotes/origin/*
ERROR: Error fetching remote repo 'origin'
hudson.plugins.git.GitException: Failed to fetch from https://github.com/phpmyadmin/phpmyadmin.git
	at hudson.plugins.git.GitSCM.fetchFrom(GitSCM.java:862)
	at hudson.plugins.git.GitSCM.retrieveChanges(GitSCM.java:1129)
	at hudson.plugins.git.GitSCM.checkout(GitSCM.java:1160)
	at hudson.scm.SCM.checkout(SCM.java:504)
	at hudson.model.AbstractProject.checkout(AbstractProject.java:1208)
	at hudson.model.AbstractBuild$AbstractBuildExecution.defaultCheckout(AbstractBuild.java:574)
	at jenkins.scm.SCMCheckoutStrategy.checkout(SCMCheckoutStrategy.java:86)
	at hudson.model.AbstractBuild$AbstractBuildExecution.run(AbstractBuild.java:499)
	at hudson.model.Run.execute(Run.java:1798)
	at hudson.model.FreeStyleBuild.run(FreeStyleBuild.java:43)
	at hudson.model.ResourceController.execute(ResourceController.java:97)
	at hudson.model.Executor.run(Executor.java:429)
Caused by: hudson.plugins.git.GitException: Command "git fetch --tags --progress https://github.com/phpmyadmin/phpmyadmin.git +refs/heads/*:refs/remotes/origin/*" returned status code 128:
stdout: 
stderr: fatal: unable to access 'https://github.com/phpmyadmin/phpmyadmin.git/': Could not resolve host: github.com

	at org.jenkinsci.plugins.gitclient.CliGitAPIImpl.launchCommandIn(CliGitAPIImpl.java:1996)
	at org.jenkinsci.plugins.gitclient.CliGitAPIImpl.launchCommandWithCredentials(CliGitAPIImpl.java:1715)
	at org.jenkinsci.plugins.gitclient.CliGitAPIImpl.access$300(CliGitAPIImpl.java:72)
	at org.jenkinsci.plugins.gitclient.CliGitAPIImpl$1.execute(CliGitAPIImpl.java:405)
	at hudson.plugins.git.GitSCM.fetchFrom(GitSCM.java:860)
	... 11 more
ERROR: Error fetching remote repo 'origin'
[CHECKSTYLE] Skipping publisher since build result is FAILURE
[JSLINT] Skipping publisher since build result is FAILURE
[PMD] Skipping publisher since build result is FAILURE
[DRY] Collecting duplicate code analysis files...
[DRY] Searching for all files in <https://ci.phpmyadmin.net/job/phpMyAdmin/ws/> that match the pattern build/logs/pmd-cpd.xml
[DRY] Parsing 1 file in <https://ci.phpmyadmin.net/job/phpMyAdmin/ws/>
[DRY] Successfully parsed file <https://ci.phpmyadmin.net/job/phpMyAdmin/ws/build/logs/pmd-cpd.xml> with 12 unique warnings and 0 duplicates.
[DRY] Computing warning deltas based on reference build #2561
[TASKS] Skipping publisher since build result is FAILURE
[ANALYSIS-COLLECTOR] Computing warning deltas based on reference build #2561
Recording plot data
Publishing Clover coverage report...
Clover xml file does not exist in: <https://ci.phpmyadmin.net/job/phpMyAdmin/ws/> called: build/logs/clover.xml and will not be copied to: /var/lib/jenkins/jobs/phpMyAdmin/builds/2562/cloverphp/clover.xml
Could not find 'build/coverage/build/logs/clover.xml'.  Did you generate the XML report for Clover?
[xUnit] [INFO] - Starting to record.
[xUnit] [INFO] - Processing PHPUnit-3.x (default)
[xUnit] [INFO] - [PHPUnit-3.x (default)] - 1 test report file(s) were found with the pattern 'build/logs/junit.xml' relative to '<https://ci.phpmyadmin.net/job/phpMyAdmin/ws/'> for the testing framework 'PHPUnit-3.x (default)'.
[xUnit] [ERROR] - Test reports were found but not all of them are new. Did all the tests run?
  * <https://ci.phpmyadmin.net/job/phpMyAdmin/ws/build/logs/junit.xml> is 23 hr old

[xUnit] [INFO] - Failing BUILD.
[xUnit] [INFO] - There are errors when processing test results.
[xUnit] [INFO] - Skipping tests recording.
[xUnit] [INFO] - Stop build.
[JDepend] JDepend plugin is ready
[JDepend] Found 6146 classes in 540 packages



More information about the Developers mailing list