[phpMyAdmin Developers] Build failed in Jenkins: phpMyAdmin-continuous #14922

Jenkins Daemon jenkins at phpmyadmin.net
Fri Feb 15 17:16:48 CET 2019


See <https://ci.phpmyadmin.net/job/phpMyAdmin-continuous/14922/display/redirect?page=changes>

Changes:

[MaurĂ­cio Meneghini Fauth] Fix for SYSTEM VERSIONED tables #14514, #14515, and #14516 (#14536)

------------------------------------------
Started by GitHub push by mauriciofauth
[EnvInject] - Loading node environment variables.
Building in workspace <https://ci.phpmyadmin.net/job/phpMyAdmin-continuous/ws/>
 > git rev-parse --is-inside-work-tree # timeout=10
Fetching changes from the remote Git repository
 > git config remote.origin.url https://github.com/phpmyadmin/phpmyadmin.git # timeout=10
Fetching upstream changes from https://github.com/phpmyadmin/phpmyadmin.git
 > git --version # timeout=10
 > git fetch --tags --progress https://github.com/phpmyadmin/phpmyadmin.git +refs/heads/*:refs/remotes/origin/*
 > git rev-parse origin/master^{commit} # timeout=10
Checking out Revision 3f6e360a4ed89b3c0cff649b626f646d49401567 (origin/master)
 > git config core.sparsecheckout # timeout=10
 > git checkout -f 3f6e360a4ed89b3c0cff649b626f646d49401567
Commit message: "Fix for SYSTEM VERSIONED tables #14514, #14515, and #14516 (#14536)"
 > git rev-list --no-walk b97460a320a524d6b33b08660d8836d4a2ba83b0 # timeout=10
 > git tag -a -f -m Jenkins Build #14922 jenkins-phpMyAdmin-continuous-14922 # timeout=10
[EnvInject] - Executing scripts and injecting environment variables after the SCM step.
[EnvInject] - Injecting as environment variables the properties content 
TESTSUITE_URL=http://ci-live.phpmyadmin.net/phpMyAdmin-continuous/workspace/
TESTSUITE_USER=pmatest
TESTSUITE_DATABASE=pmatest
XTESTSUITE_BROWSERSTACK_USER=michaliha
TESTSUITE_SERVER=localhost

[EnvInject] - Variables injected successfully.
[workspace] $ /bin/sh -xe /tmp/jenkins1517419864303274262.sh
+ composer update --no-interaction
Loading composer repositories with package information
Updating dependencies (including require-dev)
Package operations: 0 installs, 1 update, 0 removals
  - Updating phpunit/phpunit (7.5.4 => 7.5.5): Downloading (connecting...)Downloading (0%)           Downloading (5%)Downloading (10%)Downloading (15%)Downloading (20%)Downloading (25%)Downloading (30%)Downloading (35%)Downloading (40%)Downloading (45%)Downloading (50%)Downloading (55%)Downloading (60%)Downloading (65%)Downloading (70%)Downloading (75%)Downloading (80%)Downloading (85%)Downloading (90%)Downloading (95%)Downloading (100%)
Writing lock file
Generating autoload files
ocramius/package-versions:  Generating version class...
ocramius/package-versions: ...done generating version class
[workspace] $ ant ******** ******** clean locales phpunit-nocoverage phpcpd phpcs phploc jshint jshint-checkstyle
Unable to locate tools.jar. Expected to find it in /usr/lib/jvm/java-8-openjdk-amd64/lib/tools.jar
Buildfile: <https://ci.phpmyadmin.net/job/phpMyAdmin-continuous/ws/build.xml>

clean:
   [delete] Deleting directory <https://ci.phpmyadmin.net/job/phpMyAdmin-continuous/ws/build/api>
   [delete] Deleting directory <https://ci.phpmyadmin.net/job/phpMyAdmin-continuous/ws/build/code-browser>
   [delete] Deleting directory <https://ci.phpmyadmin.net/job/phpMyAdmin-continuous/ws/build/coverage>
   [delete] Deleting directory <https://ci.phpmyadmin.net/job/phpMyAdmin-continuous/ws/build/logs>
   [delete] Deleting directory <https://ci.phpmyadmin.net/job/phpMyAdmin-continuous/ws/build/pdepend>
    [mkdir] Created dir: <https://ci.phpmyadmin.net/job/phpMyAdmin-continuous/ws/build/api>
    [mkdir] Created dir: <https://ci.phpmyadmin.net/job/phpMyAdmin-continuous/ws/build/code-browser>
    [mkdir] Created dir: <https://ci.phpmyadmin.net/job/phpMyAdmin-continuous/ws/build/coverage>
    [mkdir] Created dir: <https://ci.phpmyadmin.net/job/phpMyAdmin-continuous/ws/build/logs>
    [mkdir] Created dir: <https://ci.phpmyadmin.net/job/phpMyAdmin-continuous/ws/build/pdepend>

locales:

phpunit-nocoverage:
     [exec] PHPUnit 7.5.5 by Sebastian Bergmann and contributors.
     [exec] 
     [exec] Runtime:       PHP 7.2.14-1+0~20190113100742.14+stretch~1.gbpd83c69
     [exec] Configuration: <https://ci.phpmyadmin.net/job/phpMyAdmin-continuous/ws/phpunit.xml.nocoverage>
     [exec] 
     [exec] .............................................................   61 / 2340 (  2%)
     [exec] .............................................................  122 / 2340 (  5%)
     [exec] .............................................................  183 / 2340 (  7%)
     [exec] .............................................................  244 / 2340 ( 10%)
     [exec] .............................................................  305 / 2340 ( 13%)
     [exec] .............................................................  366 / 2340 ( 15%)
     [exec] .............................................................  427 / 2340 ( 18%)
     [exec] .............................................................  488 / 2340 ( 20%)
     [exec] .............................................................  549 / 2340 ( 23%)
     [exec] .............................................................  610 / 2340 ( 26%)
     [exec] .............................................................  671 / 2340 ( 28%)
     [exec] .............................................................  732 / 2340 ( 31%)
     [exec] .............................................................  793 / 2340 ( 33%)
     [exec] .............................................................  854 / 2340 ( 36%)
     [exec] .............................................................  915 / 2340 ( 39%)
     [exec] .............................................................  976 / 2340 ( 41%)
     [exec] ............................................................. 1037 / 2340 ( 44%)
     [exec] ..................FNot supported query: SHOW FULL TABLES FROM `default` WHERE `Table_type`IN('BASE TABLE', 'SYSTEM VERSIONED')
     [exec] FNot supported query: SHOW FULL TABLES FROM `default` WHERE `Table_type`IN('BASE TABLE', 'SYSTEM VERSIONED')
     [exec] ......................................... 1098 / 2340 ( 46%)
     [exec] ............................................................. 1159 / 2340 ( 49%)
     [exec] ............................................................. 1220 / 2340 ( 52%)
     [exec] ............................................................. 1281 / 2340 ( 54%)
     [exec] ............................................................. 1342 / 2340 ( 57%)
     [exec] ............................................................. 1403 / 2340 ( 59%)
     [exec] ............................................................. 1464 / 2340 ( 62%)
     [exec] ............................................................. 1525 / 2340 ( 65%)
     [exec] ............................................................. 1586 / 2340 ( 67%)
     [exec] ............................................................. 1647 / 2340 ( 70%)
     [exec] ........................................................Not supported query: SELECT `TABLE_NAME` FROM `INFORMATION_SCHEMA`.`TABLES` WHERE `TABLE_SCHEMA`='pma_test' AND `TABLE_TYPE` IN ('BASE TABLE', 'SYSTEM VERSIONED')
     [exec] .Not supported query: SELECT `TABLE_NAME` FROM `INFORMATION_SCHEMA`.`TABLES` WHERE `TABLE_SCHEMA`='pma_test' AND `TABLE_TYPE` IN ('BASE TABLE', 'SYSTEM VERSIONED')
     [exec] .Not supported query: SELECT `TABLE_NAME` FROM `INFORMATION_SCHEMA`.`TABLES` WHERE `TABLE_SCHEMA`='pma_test' AND `TABLE_TYPE` IN ('BASE TABLE', 'SYSTEM VERSIONED')
     [exec] .Not supported query: SELECT `TABLE_NAME` FROM `INFORMATION_SCHEMA`.`TABLES` WHERE `TABLE_SCHEMA`='pma_test' AND `TABLE_TYPE` IN ('BASE TABLE', 'SYSTEM VERSIONED')
     [exec] .Not supported query: SELECT `TABLE_NAME` FROM `INFORMATION_SCHEMA`.`TABLES` WHERE `TABLE_SCHEMA`='pma_test' AND `TABLE_TYPE` IN ('BASE TABLE', 'SYSTEM VERSIONED')
     [exec] . 1708 / 2340 ( 72%)
     [exec] Not supported query: SELECT `TABLE_NAME` FROM `INFORMATION_SCHEMA`.`TABLES` WHERE `TABLE_SCHEMA`='pma_test' AND `TABLE_TYPE` IN ('BASE TABLE', 'SYSTEM VERSIONED')
     [exec] .Not supported query: SELECT `TABLE_NAME` FROM `INFORMATION_SCHEMA`.`TABLES` WHERE `TABLE_SCHEMA`='pma_test' AND `TABLE_TYPE` IN ('BASE TABLE', 'SYSTEM VERSIONED')
     [exec] .Not supported query: SELECT `TABLE_NAME` FROM `INFORMATION_SCHEMA`.`TABLES` WHERE `TABLE_SCHEMA`='pma_test' AND `TABLE_TYPE` IN ('BASE TABLE', 'SYSTEM VERSIONED')
     [exec] .Not supported query: SELECT `TABLE_NAME` FROM `INFORMATION_SCHEMA`.`TABLES` WHERE `TABLE_SCHEMA`='pma_test' AND `TABLE_TYPE` IN ('BASE TABLE', 'SYSTEM VERSIONED')
     [exec] .Not supported query: SELECT `TABLE_NAME` FROM `INFORMATION_SCHEMA`.`TABLES` WHERE `TABLE_SCHEMA`='pma_test' AND `TABLE_TYPE` IN ('BASE TABLE', 'SYSTEM VERSIONED')
     [exec] .Not supported query: SELECT `TABLE_NAME` FROM `INFORMATION_SCHEMA`.`TABLES` WHERE `TABLE_SCHEMA`='pma_test' AND `TABLE_TYPE` IN ('BASE TABLE', 'SYSTEM VERSIONED')
     [exec] .Not supported query: SELECT `TABLE_NAME` FROM `INFORMATION_SCHEMA`.`TABLES` WHERE `TABLE_SCHEMA`='pma_test' AND `TABLE_TYPE` IN ('BASE TABLE', 'SYSTEM VERSIONED')
     [exec] .Not supported query: SELECT `TABLE_NAME` FROM `INFORMATION_SCHEMA`.`TABLES` WHERE `TABLE_SCHEMA`='pma_test' AND `TABLE_TYPE` IN ('BASE TABLE', 'SYSTEM VERSIONED')
     [exec] .Not supported query: SELECT `TABLE_NAME` FROM `INFORMATION_SCHEMA`.`TABLES` WHERE `TABLE_SCHEMA`='pma_test' AND `TABLE_TYPE` IN ('BASE TABLE', 'SYSTEM VERSIONED')
     [exec] .Not supported query: SELECT `TABLE_NAME` FROM `INFORMATION_SCHEMA`.`TABLES` WHERE `TABLE_SCHEMA`='pma_test' AND `TABLE_TYPE` IN ('BASE TABLE', 'SYSTEM VERSIONED')
     [exec] .Not supported query: SELECT `TABLE_NAME` FROM `INFORMATION_SCHEMA`.`TABLES` WHERE `TABLE_SCHEMA`='pma_test' AND `TABLE_TYPE` IN ('BASE TABLE', 'SYSTEM VERSIONED')
     [exec] .Not supported query: SELECT `TABLE_NAME` FROM `INFORMATION_SCHEMA`.`TABLES` WHERE `TABLE_SCHEMA`='pma_test' AND `TABLE_TYPE` IN ('BASE TABLE', 'SYSTEM VERSIONED')
     [exec] .Not supported query: SELECT `TABLE_NAME` FROM `INFORMATION_SCHEMA`.`TABLES` WHERE `TABLE_SCHEMA`='pma_test' AND `TABLE_TYPE` IN ('BASE TABLE', 'SYSTEM VERSIONED')
     [exec] ................................................. 1769 / 2340 ( 75%)
     [exec] ............................................................. 1830 / 2340 ( 78%)
     [exec] ............................................................. 1891 / 2340 ( 80%)
     [exec] ............................................................. 1952 / 2340 ( 83%)
     [exec] ............................................................. 2013 / 2340 ( 86%)
     [exec] ............................................................. 2074 / 2340 ( 88%)
     [exec] ............................................................. 2135 / 2340 ( 91%)
     [exec] ............................................................. 2196 / 2340 ( 93%)
     [exec] ............................................................. 2257 / 2340 ( 96%)
     [exec] ............................................................. 2318 / 2340 ( 99%)
     [exec] ......................                                        2340 / 2340 (100%)
     [exec] 
     [exec] Time: 7.05 seconds, Memory: 162.25MB
     [exec] 
     [exec] There were 2 failures:
     [exec] 
     [exec] 1) PhpMyAdmin\Tests\Navigation\Nodes\NodeDatabaseTest::testGetPresence
     [exec] Failed asserting that 0 matches expected 2.
     [exec] 
     [exec] <https://ci.phpmyadmin.net/job/phpMyAdmin-continuous/ws/test/classes/Navigation/Nodes/NodeDatabaseTest.php>:66
     [exec] 
     [exec] 2) PhpMyAdmin\Tests\Navigation\Nodes\NodeDatabaseTest::testGetData
     [exec] Failed asserting that an array contains 'test1'.
     [exec] 
     [exec] <https://ci.phpmyadmin.net/job/phpMyAdmin-continuous/ws/test/classes/Navigation/Nodes/NodeDatabaseTest.php>:98
     [exec] 
     [exec] FAILURES!
     [exec] Tests: 2340, Assertions: 7842, Failures: 2.

BUILD FAILED
<https://ci.phpmyadmin.net/job/phpMyAdmin-continuous/ws/build.xml>:33: exec returned: 1

Total time: 10 seconds
Build step 'Invoke Ant' marked build as failure
[CHECKSTYLE] Skipping publisher since build result is FAILURE
[JSLINT] Skipping publisher since build result is FAILURE
[DRY] Collecting duplicate code analysis files...
[DRY] Searching for all files in <https://ci.phpmyadmin.net/job/phpMyAdmin-continuous/ws/> that match the pattern build/logs/pmd-cpd.xml
[DRY] No files found. Configuration error?
[DRY] Computing warning deltas based on reference build #14921
[TASKS] Skipping publisher since build result is FAILURE
[ANALYSIS-COLLECTOR] Computing warning deltas based on reference build #14921
Recording plot data
INFO: Starting to record.
INFO: Processing PHPUnit-3.x (default)
INFO: [PHPUnit-3.x (default)] - 1 test report file(s) were found with the pattern 'build/logs/junit.xml' relative to '<https://ci.phpmyadmin.net/job/phpMyAdmin-continuous/ws/'> for the testing framework 'PHPUnit-3.x (default)'.
INFO: Check 'Failed Tests' threshold.
INFO: Check 'Skipped Tests' threshold.
INFO: Setting the build status to FAILURE
INFO: Stopping recording.



More information about the Developers mailing list