[Phpmyadmin-devel] Build failed in Jenkins: phpMyAdmin-continuous #2535

michal at cihar.com michal at cihar.com
Sat Dec 15 19:32:05 CET 2012

See <http://ci.phpmyadmin.net/job/phpMyAdmin-continuous/2535/changes>


[weblate] Translated using Weblate (Chinese (Taiwan))

[weblate] Translated using Weblate (Turkish)

Started by GitHub push by 
Building in workspace <http://ci.phpmyadmin.net/job/phpMyAdmin-continuous/ws/>
Checkout:workspace / <http://ci.phpmyadmin.net/job/phpMyAdmin-continuous/ws/> - hudson.remoting.LocalChannel at 3ff9f663
Using strategy: Default
Last Built Revision: Revision 935376cd496ed3fd692691cf52946c3dbfe9c9b3 (origin/master)
Fetching changes from 1 remote Git repository
Fetching upstream changes from git://github.com/phpmyadmin/phpmyadmin.git
Commencing build of Revision 8bbacc735ec8cd76a78cfb5e5f03471f1d56ae40 (origin/master)
Checking out Revision 8bbacc735ec8cd76a78cfb5e5f03471f1d56ae40 (origin/master)
[workspace] $ /bin/sh -xe /tmp/hudson1015853050382603793.sh
+ ./scripts/generate-mo --quiet
po/zh_TW.po:1191: format specifications in 'msgid' and 'msgstr' for argument 1 are not the same
msgfmt: found 1 fatal error
Build step 'Execute shell' marked build as failure
[CHECKSTYLE] Skipping publisher since build result is FAILURE
[DRY] Collecting duplicate code analysis files...
[DRY] Finding all files that match the pattern build/logs/pmd-cpd.xml
[DRY] Parsing 1 files in <http://ci.phpmyadmin.net/job/phpMyAdmin-continuous/ws/>
[DRY] Successfully parsed file <http://ci.phpmyadmin.net/job/phpMyAdmin-continuous/ws/build/logs/pmd-cpd.xml> of module  with 20 warnings.
[DRY] Computing warning deltas based on reference build #2534
[TASKS] Skipping publisher since build result is FAILURE
[ANALYSIS-COLLECTOR] Computing warning deltas based on reference build #2534
Recording plot data
[xUnit] [INFO] - Starting to record.
[xUnit] [INFO] - Processing PHPUnit-3.4 (default)
[xUnit] [INFO] - [PHPUnit-3.4 (default)] - 1 test report file(s) were found with the pattern 'build/logs/junit.xml' relative to '<http://ci.phpmyadmin.net/job/phpMyAdmin-continuous/ws/'> for the testing framework 'PHPUnit-3.4 (default)'.
[xUnit] [ERROR] - Test reports were found but not all of them are new. Did all the tests run?
  * <http://ci.phpmyadmin.net/job/phpMyAdmin-continuous/ws/build/logs/junit.xml> is 1 min 59 sec old

[xUnit] [INFO] - Setting the build status to FAILURE
[xUnit] [INFO] - Stopping recording.

More information about the Developers mailing list